program: Orca
programVersion: 5.0.2
elementType: S P O O O O N C C C C C C C C C C H H H H H H H H H H H H H H H H H H H H
charge: 0
multiplicity: 1
keywords: wb97x-d3
keywords: def2-TZVPP
keywords: def2/J RIJCOSX
keywords: DEFGRID2
keywords: scfconv7
keywords: smallprint printgap noloewdin
keywords: NOSOSCF
formula: C10H20NO4PS
InChI: InChI=1/C10H20NO4PS/c1-6-11-16(17,13-5)15-9(4)7-10(12)14-8(2)3/h7-8,11H,6H2,1-5H3
37 atoms
S  -2.517763 -1.760108 -1.368555
P  -2.085303 -0.266168 -0.249209
O  -1.051296 -0.519586 0.977119
O  3.346136 0.620017 0.307437
O  -1.314503 0.960369 -0.955529
O  3.124881 -1.600209 0.497865
N  -3.378858 0.387992 0.520546
C  4.768008 0.518801 0.141931
C  -3.362263 1.561712 1.377432
C  0.22101 -1.02581 0.812599
C  5.34109 1.851141 0.583457
C  5.107627 0.193786 -1.301758
C  -4.033761 2.765939 0.739243
C  1.212082 -0.153333 0.606365
C  2.635467 -0.499482 0.471063
C  0.277974 -2.502408 0.960012
C  -1.697916 1.372118 -2.25892
H  5.147499 -0.275374 0.790096
H  -2.328379 1.800529 1.626224
H  -3.84581 1.313479 2.324889
H  -4.241359 -0.124589 0.441996
H  4.964085 2.669594 -0.031174
H  6.426998 1.836824 0.490897
H  5.097459 2.06451 1.62406
H  4.709374 0.95255 -1.977031
H  4.715628 -0.7777 -1.598021
H  6.19014 0.166813 -1.430947
H  -4.033084 3.615118 1.423276
H  -3.511098 3.064985 -0.168934
H  -5.07039 2.552046 0.476908
H  0.967724 0.897908 0.537539
H  -0.176657 -2.7937 1.908564
H  1.293183 -2.877042 0.918424
H  -0.311908 -2.968725 0.167901
H  -1.021765 2.17328 -2.54806
H  -1.614728 0.550856 -2.971554
H  -2.723142 1.748925 -2.27504
totalener: -1488.51223229 hartree
nucrepener: 1593.22602510 hartree
electener: -3081.73825738 hartree
oneelecener: -5211.58858003 hartree
twoeener: 2129.85032265 hartree
kineticenergy: 1483.79884091 hartree
xcener: -107.359327504437 hartree
chargesum: 0.0000000
charge: -0.394341 0.606445 -0.332861 -0.275070 -0.320108 -0.401910 -0.241017 0.140996 -0.028400 0.243639 -0.227693 -0.258098 -0.227947 -0.264751 0.447004 -0.218177 -0.118316 0.060781 0.083329 0.085892 0.144256 0.081175 0.076136 0.090331 0.081491 0.105181 0.079818 0.083946 0.075073 0.075220 0.108146 0.090660 0.116808 0.101019 0.116401 0.120209 0.094730
qa: -0.3943 0.6064 -0.3329 -0.2751 -0.3201 -0.4019 -0.2410 0.1410 -0.0284 0.2436 -0.2277 -0.2581 -0.2279 -0.2648 0.4470 -0.2182 -0.1183 0.0608 0.0833 0.0859 0.1443 0.0812 0.0761 0.0903 0.0815 0.1052 0.0798 0.0839 0.0751 0.0752 0.1081 0.0907 0.1168 0.1010 0.1164 0.1202 0.0947
va: 2.0664 5.5360 2.1087 2.1362 2.0537 2.0968 3.0734 3.8588 3.9052 3.7070 3.9257 3.9088 3.9300 3.9609 4.1669 3.9453 3.8696 1.0239 1.0121 0.9992 1.0400 1.0097 1.0083 1.0113 1.0085 1.0166 1.0092 1.0130 1.0050 1.0058 1.0391 1.0048 1.0335 1.0196 0.9895 1.0078 0.9904
dispcorr: -0.016289102 hartree
energy: -1488.528521387482
dipole: 11.34936 -11.82661 -0.47725 15.10792 -13.39284 1.71507 0.38981 -0.07817 0.31164
magnitude: 1.80731 au
magnitude: 4.59381 debye
