program: Orca
programVersion: 5.0.2
elementType: S P O O O O N C C C C C C C C C C H H H H H H H H H H H H H H H H H H H H
charge: 0
multiplicity: 1
keywords: wb97x-d3
keywords: def2-TZVPP
keywords: def2/J RIJCOSX
keywords: DEFGRID2
keywords: scfconv7
keywords: smallprint printgap noloewdin
keywords: NOSOSCF
formula: C10H20NO4PS
InChI: InChI=1/C10H20NO4PS/c1-6-11-16(17,13-5)15-9(4)7-10(12)14-8(2)3/h7-8,11H,6H2,1-5H3
37 atoms
S  -2.362271 -1.744987 -1.344021
P  -2.023142 -0.211711 -0.247189
O  -1.019042 -0.401387 1.014596
O  3.388417 0.612486 0.203406
O  -1.276502 1.027348 -0.958162
O  3.13811 -1.580885 0.578003
N  -3.365466 0.412852 0.462165
C  4.806251 0.473831 0.031007
C  -3.423604 1.604766 1.292228
C  0.248222 -0.933501 0.893463
C  5.406393 1.828262 0.352887
C  5.122398 0.023732 -1.38417
C  -4.160165 2.751427 0.620296
C  1.247489 -0.099808 0.590146
C  2.663811 -0.47891 0.466689
C  0.287359 -2.388333 1.188103
C  -1.653486 1.406646 -2.273583
H  5.180747 -0.270065 0.73901
H  -2.407172 1.910335 1.539515
H  -3.898544 1.352154 2.243054
H  -4.20091 -0.142588 0.380925
H  5.177541 2.132998 1.373886
H  5.036336 2.598301 -0.32505
H  6.490671 1.786876 0.251611
H  6.20245 -0.036149 -1.521618
H  4.731037 0.732332 -2.115585
H  4.70794 -0.960515 -1.595401
H  -3.649611 3.058528 -0.291979
H  -5.180265 2.470021 0.357049
H  -4.215389 3.615496 1.282986
H  1.017389 0.943446 0.422958
H  -0.166966 -2.577587 2.16234
H  1.297149 -2.779656 1.180833
H  -0.311435 -2.922353 0.446811
H  -1.005739 2.230968 -2.561665
H  -1.524364 0.580475 -2.973565
H  -2.692687 1.740614 -2.312102
totalener: -1488.51242304 hartree
nucrepener: 1593.82344504 hartree
electener: -3082.33586807 hartree
oneelecener: -5212.80357628 hartree
twoeener: 2130.46770821 hartree
kineticenergy: 1483.80159408 hartree
xcener: -107.359573758078 hartree
chargesum: 0.0000000
charge: -0.393677 0.611188 -0.333647 -0.275100 -0.322067 -0.401630 -0.242705 0.142217 -0.029465 0.237079 -0.227725 -0.258108 -0.227543 -0.262061 0.447146 -0.215841 -0.117879 0.059742 0.083647 0.086239 0.144050 0.090316 0.080858 0.076147 0.079620 0.081313 0.105841 0.075159 0.075113 0.083982 0.110830 0.090063 0.116051 0.100144 0.116142 0.120126 0.094440
qa: -0.3937 0.6112 -0.3336 -0.2751 -0.3221 -0.4016 -0.2427 0.1422 -0.0295 0.2371 -0.2277 -0.2581 -0.2275 -0.2621 0.4471 -0.2158 -0.1179 0.0597 0.0836 0.0862 0.1440 0.0903 0.0809 0.0761 0.0796 0.0813 0.1058 0.0752 0.0751 0.0840 0.1108 0.0901 0.1161 0.1001 0.1161 0.1201 0.0944
va: 2.0665 5.5308 2.1060 2.1363 2.0553 2.0969 3.0735 3.8588 3.9046 3.7167 3.9255 3.9090 3.9317 3.9583 4.1641 3.9454 3.8701 1.0241 1.0127 0.9990 1.0402 1.0113 1.0098 1.0083 1.0092 1.0086 1.0166 1.0047 1.0056 1.0129 1.0388 1.0046 1.0335 1.0191 0.9896 1.0074 0.9906
dispcorr: -0.016274738 hartree
energy: -1488.528697773496
dipole: 10.61392 -11.16006 -0.54615 14.50943 -12.81623 1.69320 -0.26931 0.52096 0.25164
magnitude: 1.79681 au
magnitude: 4.56714 debye
