program: Orca
programVersion: 5.0.2
elementType: S P O O O O N C C C C C C C C C C H H H H H H H H H H H H H H H H H H H H
charge: 0
multiplicity: 1
keywords: wb97x-d3
keywords: def2-TZVPP
keywords: def2/J RIJCOSX
keywords: DEFGRID2
keywords: scfconv7
keywords: smallprint printgap noloewdin
keywords: NOSOSCF
formula: C10H20NO4PS
InChI: InChI=1/C10H20NO4PS/c1-6-11-16(17,13-5)15-9(4)7-10(12)14-8(2)3/h7-8,11H,6H2,1-5H3
37 atoms
S  -2.031853 -1.605507 -1.53391
P  -1.991049 -0.14346 -0.29868
O  -1.051959 -0.325757 1.015853
O  3.360305 0.54383 0.012529
O  -1.388082 1.252384 -0.828706
O  3.08943 -1.574635 0.683596
N  -3.466036 0.249839 0.323242
C  4.767095 0.348005 -0.196424
C  -3.692788 1.242664 1.363432
C  0.217271 -0.863825 0.94555
C  5.518977 0.433559 1.119722
C  5.202658 1.418412 -1.177541
C  -5.03021 1.934796 1.173564
C  1.22015 -0.073784 0.550617
C  2.628414 -0.48764 0.442315
C  0.244979 -2.284559 1.37463
C  -1.818277 1.75613 -2.085934
H  4.925641 -0.639054 -0.638605
H  -2.890173 1.978507 1.315797
H  -3.63812 0.787669 2.356836
H  -4.150642 -0.487976 0.259905
H  6.588997 0.319625 0.942245
H  5.214576 -0.35099 1.809619
H  5.361413 1.40145 1.597833
H  5.049775 2.418213 -0.769241
H  4.655412 1.344704 -2.11694
H  6.263918 1.307526 -1.400144
H  -5.072537 2.44514 0.211998
H  -5.857934 1.224883 1.213448
H  -5.195042 2.6715 1.959577
H  0.999794 0.949922 0.280454
H  -0.244439 -2.385619 2.344847
H  1.252521 -2.67663 1.436535
H  -0.32722 -2.881217 0.659877
H  -1.265223 2.675516 -2.263956
H  -1.608628 1.045939 -2.886824
H  -2.887512 1.978186 -2.079757
totalener: -1488.51325013 hartree
nucrepener: 1588.57225830 hartree
electener: -3077.08550843 hartree
oneelecener: -5202.32705788 hartree
twoeener: 2125.24154945 hartree
kineticenergy: 1483.79484636 hartree
xcener: -107.356109302408 hartree
chargesum: -0.0000000
charge: -0.387625 0.617004 -0.329012 -0.275178 -0.324771 -0.403454 -0.247073 0.144621 -0.036889 0.223062 -0.259510 -0.229303 -0.228750 -0.258054 0.452642 -0.218797 -0.112410 0.060756 0.088240 0.089128 0.136334 0.080010 0.104717 0.080977 0.080958 0.091480 0.076229 0.080695 0.072824 0.082062 0.118297 0.088635 0.116989 0.097398 0.113905 0.114307 0.099557
qa: -0.3876 0.6170 -0.3290 -0.2752 -0.3248 -0.4035 -0.2471 0.1446 -0.0369 0.2231 -0.2595 -0.2293 -0.2288 -0.2581 0.4526 -0.2188 -0.1124 0.0608 0.0882 0.0891 0.1363 0.0800 0.1047 0.0810 0.0810 0.0915 0.0762 0.0807 0.0728 0.0821 0.1183 0.0886 0.1170 0.0974 0.1139 0.1143 0.0996
va: 2.0689 5.5165 2.0959 2.1392 2.0651 2.0938 3.0716 3.8570 3.9022 3.7416 3.9062 3.9272 3.9460 3.9404 4.1613 3.9433 3.8660 1.0229 1.0084 0.9971 1.0417 1.0090 1.0183 1.0085 1.0094 1.0113 1.0081 1.0065 1.0041 1.0102 1.0372 1.0049 1.0343 1.0180 0.9910 1.0059 0.9931
dispcorr: -0.015966777 hartree
energy: -1488.529216903890
dipole: 8.14926 -8.88891 -0.73966 12.47291 -10.97613 1.49678 3.87424 -3.50290 0.37134
magnitude: 1.71036 au
magnitude: 4.34740 debye
