program: Orca
programVersion: 5.0.2
elementType: S P O O O O N C C C C C C C C C C H H H H H H H H H H H H H H H H H H H H
charge: 0
multiplicity: 1
keywords: wb97x-d3
keywords: def2-TZVPP
keywords: def2/J RIJCOSX
keywords: DEFGRID2
keywords: scfconv7
keywords: smallprint printgap noloewdin
keywords: NOSOSCF
formula: C10H20NO4PS
InChI: InChI=1/C10H20NO4PS/c1-6-11-16(17,13-5)15-9(4)7-10(12)14-8(2)3/h7-8,11H,6H2,1-5H3
37 atoms
S  -1.293217 2.554764 -0.564211
P  -1.898983 0.757752 -0.306991
O  -1.139794 -0.445532 -1.105896
O  3.147692 0.12857 0.628171
O  -1.752432 0.15581 1.175595
O  2.954325 -1.609208 -0.773966
N  -3.466681 0.531221 -0.773319
C  4.532767 -0.156448 0.868279
C  -4.111336 -0.750801 -1.04296
C  0.156896 -0.851365 -1.031504
C  4.677136 -1.278048 1.882486
C  5.152676 1.139327 1.353592
C  -4.129404 -1.68972 0.149409
C  1.075516 -0.213488 -0.29371
C  2.465583 -0.664595 -0.202941
C  0.372293 -2.067052 -1.87558
C  -2.156436 0.934534 2.291999
H  5.003569 -0.457414 -0.071473
H  -3.654456 -1.250483 -1.902402
H  -5.138933 -0.519621 -1.325712
H  -3.81641 1.307533 -1.312477
H  4.189484 -1.018179 2.82334
H  5.732783 -1.455348 2.09136
H  4.252856 -2.210428 1.514447
H  5.037817 1.935826 0.618833
H  6.219101 0.99759 1.529278
H  4.699956 1.469736 2.289356
H  -4.727035 -2.568874 -0.090984
H  -3.134243 -2.035623 0.420939
H  -4.572825 -1.207766 1.020225
H  0.822863 0.677567 0.263513
H  0.685125 -2.914761 -1.267789
H  1.158914 -1.905361 -2.609341
H  -0.546264 -2.330184 -2.395578
H  -3.236302 1.096071 2.291542
H  -1.880678 0.375549 3.182875
H  -1.653162 1.902523 2.300838
totalener: -1488.51015673 hartree
nucrepener: 1610.47226134 hartree
electener: -3098.98241807 hartree
oneelecener: -5246.09369664 hartree
twoeener: 2147.11127857 hartree
kineticenergy: 1483.79676150 hartree
xcener: -107.359422684886 hartree
chargesum: -0.0000000
charge: -0.371061 0.565525 -0.284478 -0.273810 -0.305494 -0.411029 -0.251349 0.149421 -0.039277 0.258690 -0.261963 -0.229746 -0.240672 -0.223993 0.397385 -0.218693 -0.117717 0.058727 0.087067 0.082319 0.144142 0.081206 0.079452 0.103271 0.092873 0.074546 0.080987 0.089054 0.088450 0.075971 0.081989 0.101840 0.107372 0.091974 0.101845 0.118925 0.116253
qa: -0.3711 0.5655 -0.2845 -0.2738 -0.3055 -0.4110 -0.2513 0.1494 -0.0393 0.2587 -0.2620 -0.2297 -0.2407 -0.2240 0.3974 -0.2187 -0.1177 0.0587 0.0871 0.0823 0.1441 0.0812 0.0795 0.1033 0.0929 0.0745 0.0810 0.0891 0.0885 0.0760 0.0820 0.1018 0.1074 0.0920 0.1018 0.1189 0.1163
va: 2.0929 5.5342 2.1673 2.1391 2.0496 2.0930 3.0821 3.8530 3.9298 3.7872 3.9053 3.9287 3.9131 3.8262 4.2793 3.9427 3.8526 1.0237 0.9963 0.9943 1.0384 1.0085 1.0093 1.0180 1.0113 1.0078 1.0094 1.0104 1.0125 1.0090 1.0681 1.0082 1.0104 1.0126 0.9967 0.9900 1.0096
dispcorr: -0.016785430 hartree
energy: -1488.526942159580
dipole: 6.58065 -7.79498 -1.21433 -10.71061 10.16103 -0.54958 9.39426 -8.82155 0.57271
magnitude: 1.45073 au
magnitude: 3.68747 debye
