program: Gaussian 09
title: 000066329
version: EM64L-G09RevD.01
frameworkgroup: C1[X(C5H10O)]
method: RPBEPBE
basis: SDD
operation: Freq
keyword: #pfreq=noraman
keyword: PBEPBE/SDD
title: #p freq=noraman PBEPBE/SDD
converged: YES YES NO NO
title: Mulliken charges:
elementType: O C C C C C H H H H H H H H H H
charge: -0.465095 -0.197909 0.583371 -0.719562 -0.809216 -0.754653 0.204777 0.233383 0.208324 0.234953 0.216411 0.218914 0.264390 0.219391 0.223227 0.339295
chargesum: 0.00000
title: Mulliken charges with hydrogens summed into heavy atoms:
elementType: O C C C C C
charge: -0.125799 0.006868 0.583371 -0.042903 -0.109501 -0.312035
polarizability: 6.79424327e+01 -6.80395531e+00 5.88197142e+01 -2.04157903e+00 4.61099996e+00 4.62366787e+01
1716.lowfreq: -15.9880 -12.8006 -0.0006 0.0001 0.0006 2.7423 54.9865 161.0953 223.4464
frequency: 54.9275 161.0091 223.4363 237.4664 256.6558 269.3961 347.7263 428.6524 536.8673 546.4044 715.0443 746.7253 863.8962 942.2077 944.7752 986.2561 1024.4742 1039.4632 1064.3443 1086.3880 1186.7359 1297.3000 1308.6739 1363.1217 1383.1911 1387.6409 1433.7306 1453.3086 1468.1217 1474.0332 1480.4190 1673.0360 2955.6291 2974.6767 2977.8573 3057.6034 3068.1649 3087.1058 3093.9059 3096.1433 3190.1303 3557.5475
redmass: 2.6318 1.0857 1.8493 1.2372 1.2425 2.4740 2.9399 2.1771 2.3089 3.3013 1.1311 2.6341 2.6384 1.7854 1.3495 1.2913 2.0058 1.5800 1.7036 2.0685 1.2675 1.2478 1.6970 1.8014 1.2342 1.2355 1.1809 1.0494 1.0533 1.0697 1.0703 5.0885 1.0845 1.0383 1.0383 1.0935 1.0971 1.0632 1.1000 1.1002 1.1136 1.0661
irintensity: 1.3516 1.4101 15.5304 43.4054 90.3528 6.4420 7.9482 2.0008 11.2898 2.3413 1.8512 1.2825 30.8148 25.0092 62.6010 5.9784 10.5631 67.4261 37.3660 8.5693 38.8323 6.4440 3.2722 10.1445 15.8599 26.1166 1.9440 19.1108 12.7158 8.3531 20.9128 16.9743 52.8431 23.9502 24.2033 24.5513 36.6448 8.2412 24.1327 23.7717 25.5149 3.5637
temp: 298.150 k
press: 1.00000 atm
elementType: 8 6 6 6 6 6 1 1 1 1 1 1 1 1 1 1
symmnumber: 1
zpe: 361536.6 jmol-1
zpe.correction: 0.137702 hartree
zpe.thermalcorrener: 0.145596 hartree
zpe.thermalcorrenthalpy: 0.146540 hartree
zpe.thermalcorrgfe: 0.106127 hartree
zpe.sumelectzpe: -271.224502 hartree
zpe.sumelectthermal: -271.216608 hartree
zpe.sumelectthermalent: -271.215664 hartree
zpe.sumelectthermalfe: -271.256078 hartree
dipole: -1.3623 -1.0797 0.9902
dipole: 2.0005
quadrupole: -32.3722 -38.5186 -40.4501
quadrupole: 1.0078 1.3357 2.4335
quadrupole: 4.7414 -1.4050 -3.3364 1.0078 1.3357 2.4335
hfenergy: -271.3622044 hartree
pointgroup: C01 [X(C5H10O1)]
dipole: -0.5300919 -0.0211187 0.5814104 debye
dipolederiv: -0.3602233 0.1145503 -0.2386452 0.0772282 -0.5195681 -0.0879072 -0.2486969 -0.0728756 -0.7551972 0.493295 -0.1169597 0.1836768 -0.0242717 0.3403999 0.0626322 0.2176658 0.0126358 0.6425514 0.1690389 -0.0074508 -0.0423295 -0.0458923 0.2866435 -0.1539345 0.0606483 -0.1417855 -0.0647639 -0.0825271 0.0884829 0.0907488 0.045235 0.0004197 -0.0864422 -0.0106127 -0.0632418 -0.1393767 -0.0265018 -0.0053333 -0.0080288 -0.0227205 -0.1486867 0.1072567 -0.0025189 0.0941514 0.0126725 -0.109303 0.1614979 0.0136913 0.109492 -0.1472585 -0.0989507 -0.0315491 -0.0821901 -0.4240942 0.0025023 0.0050085 -0.0175029 -0.0097193 -0.2203858 0.0589435 -0.0076866 0.0474705 -0.0346434 0.1020747 -0.0155316 0.013773 0.0200662 -0.1361536 0.0090908 0.0029853 0.0580178 0.0768976 -0.2035489 -0.0590529 0.0311154 -0.0784395 0.0490201 -0.0158161 0.0096017 -0.0217677 0.07761 0.0671345 0.0233647 -0.0999157 0.0187968 0.0910765 0.0321727 -0.0744889 0.021252 -0.1084982 0.06771 0.0818586 0.0842314 0.090736 -0.0653019 -0.0644173 0.0628239 -0.1148941 0.0143133 -0.1644482 -0.0856525 0.02853 -0.0152018 0.0664176 0.0136867 -0.0060602 0.0106516 0.1055272 0.1195663 0.0000619 -0.0773607 0.0319226 0.0801085 0.0215056 -0.0602168 0.0558508 -0.0510895 0.0682194 -0.0793842 0.0115129 -0.0433398 -0.0889002 0.0953887 0.0057746 0.093598 0.1571252 -0.1187559 -0.0462526 -0.0095661 -0.0812804 0.0734509 0.0388008 -0.0062451 0.0400618 0.1879861 -0.024233 -0.0592073 0.0360695 -0.0726115 0.3387184 0.0679903 0.0885755 0.063065 0.3029798 unknown
polarizability: 68.2494407|-6.0073101|56.5822966|3.4564506|-6.3847181|48.1670882 unknown
InChI: InChI=1S/C5H10O/c1-4(2)5(3)6/h5-6H,1H2,2-3H3
charge 0 multiplicity 1
16 atoms
O  -1.289181 -0.151537 -1.257094
C  -0.715779 -0.450125 0.078176
C  0.752563 -0.038523 0.025752
C  -1.50644 0.287669 1.183167
C  1.053637 1.355931 -0.485513
C  1.718282 -0.898929 0.440724
H  -0.771014 -1.543921 0.266554
H  -1.524389 1.375085 0.992348
H  -2.553467 -0.071377 1.223794
H  -1.05043 0.112068 2.173775
H  0.591411 2.133111 0.153857
H  2.140169 1.542987 -0.521997
H  0.630563 1.482638 -1.49786
H  1.480682 -1.914578 0.78062
H  2.77667 -0.614324 0.446093
H  -2.267879 -0.303575 -1.223195
