program: Orca
programVersion: 5.0.2
elementType: S P O O O O N C C C C C C C C C C H H H H H H H H H H H H H H H H H H H H
charge: 0
multiplicity: 1
keywords: wb97x-d3
keywords: def2-TZVPP
keywords: def2/J RIJCOSX
keywords: DEFGRID2
keywords: scfconv7
keywords: smallprint printgap noloewdin
keywords: NOSOSCF
formula: C10H20NO4PS
InChI: InChI=1/C10H20NO4PS/c1-6-11-16(17,13-5)15-9(4)7-10(12)14-8(2)3/h7-8,11H,6H2,1-5H3
37 atoms
S  -2.50208 -1.980131 -0.950118
P  -2.101213 -0.251254 -0.230456
O  -1.013211 -0.173849 0.97212
O  3.37418 0.499063 -0.214095
O  -1.429245 0.815501 -1.230007
O  3.127262 -1.452237 0.855917
N  -3.407158 0.530414 0.40257
C  4.791966 0.30888 -0.337401
C  -3.339414 1.798193 1.11516
C  0.238129 -0.750201 0.943785
C  5.493853 0.72025 0.944776
C  5.228413 1.140595 -1.527528
C  -4.604787 2.609184 0.907327
C  1.24049 -0.031658 0.429097
C  2.652951 -0.442073 0.401634
C  0.260242 -2.096763 1.569622
C  -1.947684 0.955075 -2.545023
H  4.994188 -0.74686 -0.535801
H  -2.482727 2.356618 0.738119
H  -3.161622 1.639195 2.182866
H  -4.173703 -0.076437 0.650782
H  6.571904 0.600078 0.831807
H  5.181338 0.107397 1.788542
H  5.297259 1.767226 1.180742
H  5.03496 2.201675 -1.364933
H  4.71207 0.83366 -2.436882
H  6.29866 1.017574 -1.693564
H  -4.541849 3.556704 1.442065
H  -4.762883 2.822434 -0.149214
H  -5.484659 2.082124 1.279966
H  1.015322 0.940304 0.011652
H  -0.147884 -2.038979 2.580522
H  1.2595 -2.512271 1.612425
H  -0.387178 -2.768003 1.00099
H  -2.976028 1.321669 -2.529201
H  -1.31883 1.679329 -3.056968
H  -1.919048 0.005928 -3.081659
totalener: -1488.51332400 hartree
nucrepener: 1583.41874311 hartree
electener: -3071.93206711 hartree
oneelecener: -5191.96197075 hartree
twoeener: 2120.02990364 hartree
kineticenergy: 1483.79629269 hartree
xcener: -107.356768865967 hartree
chargesum: -0.0000000
charge: -0.390753 0.612140 -0.328147 -0.275138 -0.321350 -0.402455 -0.244082 0.143683 -0.032759 0.231751 -0.257921 -0.228183 -0.230457 -0.261607 0.447954 -0.217461 -0.113323 0.060433 0.087413 0.087458 0.136015 0.080034 0.103701 0.081166 0.080415 0.091582 0.076441 0.081498 0.081329 0.072959 0.112609 0.088561 0.117344 0.100489 0.100664 0.113670 0.114324
qa: -0.3908 0.6121 -0.3281 -0.2751 -0.3214 -0.4025 -0.2441 0.1437 -0.0328 0.2318 -0.2579 -0.2282 -0.2305 -0.2616 0.4480 -0.2175 -0.1133 0.0604 0.0874 0.0875 0.1360 0.0800 0.1037 0.0812 0.0804 0.0916 0.0764 0.0815 0.0813 0.0730 0.1126 0.0886 0.1173 0.1005 0.1007 0.1137 0.1143
va: 2.0699 5.5235 2.1011 2.1379 2.0663 2.0950 3.0687 3.8568 3.9036 3.7182 3.9112 3.9257 3.9459 3.9634 4.1660 3.9471 3.8679 1.0237 1.0075 0.9968 1.0411 1.0093 1.0171 1.0084 1.0097 1.0113 1.0082 1.0099 1.0070 1.0040 1.0379 1.0047 1.0338 1.0189 0.9927 0.9909 1.0059
dispcorr: -0.015848163 hartree
energy: -1488.529172158838
dipole: 10.36168 -10.84446 -0.48278 14.36700 -12.70849 1.65851 0.82622 -0.80718 0.01904
magnitude: 1.72745 au
magnitude: 4.39083 debye
