program: Gaussian 09
title: 000066435
version: EM64L-G09RevD.01
frameworkgroup: C1[X(C18H25O5P)]
method: RPBEPBE
basis: SDD
operation: Freq
keyword: #p
keyword: freq=noraman
keyword: PBEPBE/SDD
title: #p freq=noraman PBEPBE/SDD
converged: YES YES NO NO
title: Mulliken charges:
elementType: P O O O O O C C C C C C C C C C C C C C C C C C H H H H H H H H H H H H H H H H H H H H H H H H H
charge: 1.337544 -0.544033 -0.646790 -0.668666 -0.592235 -0.438380 0.371548 -0.133674 -0.115766 -0.161064 -0.121790 -0.520482 -0.558688 -0.488937 -0.440739 -0.507959 -0.816300 0.252939 -0.579673 0.301076 -0.344994 -0.538066 -0.447240 0.287176 0.212772 0.243003 0.204477 0.268171 0.198283 0.230044 0.213758 0.232640 0.224877 0.193759 0.239875 0.220713 0.221761 0.215778 0.252486 0.222277 0.225831 0.223659 0.228045 0.222308 0.255208 0.217924 0.397101 0.398191 0.352253
chargesum: 0.00000
title: Mulliken charges with hydrogens summed into heavy atoms:
elementType: P O O O O O C C C C C C C C C C C C C C C C C C
charge: 1.337544 -0.544033 -0.249688 -0.270474 -0.592235 -0.086127 0.371548 0.079098 0.127237 0.043413 0.146381 -0.092156 -0.112290 -0.070302 0.019849 -0.070420 -0.115706 0.252939 -0.127970 0.301076 -0.122686 -0.282858 -0.229316 0.287176
polarizability: 3.12833521e+02 -9.17024744e+00 2.18790457e+02 3.96716462e+00 2.23768214e+00 1.53755032e+02
1716.lowfreq: -5.1841 -0.0008 0.0013 0.0013 3.9560 7.1162 11.0046 29.0373 33.9158
frequency: 6.5630 28.6010 33.7806 47.4508 70.7484 95.8237 112.5360 126.0051 139.9948 154.7511 169.2932 193.6465 205.5595 209.9904 227.9476 229.4244 254.2638 267.6586 278.0969 294.5194 306.3574 333.2495 340.6621 350.6637 350.8553 366.9835 377.1771 384.8927 404.9970 436.6029 442.7433 446.7381 470.0848 482.7257 509.5995 521.5917 534.4707 560.8008 607.6461 619.2278 640.8948 657.1250 706.8945 716.2942 723.7479 745.0887 770.9138 778.5568 806.2840 823.4730 835.1219 844.9589 852.3983 884.0475 900.8551 909.7631 923.4035 929.7150 947.8470 963.7974 974.2613 993.8695 1004.3682 1011.0510 1022.6946 1024.3759 1031.3846 1042.3115 1058.8508 1074.4153 1076.9977 1086.8952 1102.9088 1118.1835 1129.3117 1134.3879 1148.5972 1166.5604 1175.6034 1178.7755 1183.9362 1205.2112 1210.3805 1219.4461 1236.1366 1246.3589 1252.3784 1257.4488 1265.9614 1276.6607 1278.0007 1286.5308 1298.5340 1303.1939 1315.3733 1324.6294 1332.4142 1334.2525 1340.9567 1350.4334 1353.8602 1375.8944 1383.5306 1395.8300 1442.3403 1457.4938 1459.1925 1466.4463 1470.8047 1472.3517 1479.7797 1492.5488 1493.4667 1495.1401 1587.1439 1631.6370 2895.7582 2907.0557 2958.7363 2961.0509 2961.8002 2973.0054 2984.8160 2996.9135 2998.5298 2999.8324 3019.8446 3024.3951 3032.5275 3035.8832 3042.9842 3055.6546 3084.9998 3090.1230 3095.7112 3110.8456 3140.8385 3150.8957 3582.9465 3594.3014 3603.6866
redmass: 7.4630 5.4817 5.7052 4.2752 4.6404 4.3282 3.2865 3.7323 2.7269 3.4926 2.6749 2.3822 1.7246 2.0341 1.7368 2.2051 3.2804 2.4039 2.3925 3.4507 2.5044 3.7564 3.4139 1.1174 3.2235 3.2218 4.9193 5.1327 3.9982 3.6057 3.1400 3.5399 4.3464 2.7082 3.6660 4.9248 3.2368 2.6921 2.8928 3.3578 3.2087 8.7674 3.5665 2.7189 3.9334 8.0340 3.2676 2.7277 1.8869 1.9010 1.6605 2.1504 2.2006 1.6853 1.9646 3.6283 1.4339 2.0410 1.8899 4.4129 1.9742 2.2500 1.6795 2.0408 1.9634 1.3198 1.9648 2.3556 2.5603 2.7092 2.9349 1.8641 2.0992 2.0795 2.0334 1.3715 1.4723 1.6505 1.4326 1.5204 1.6631 1.9031 1.2040 1.7027 1.4589 1.4781 1.4860 2.5833 1.5229 1.3195 1.4284 1.3425 1.5866 1.3892 1.3716 1.3948 1.4267 1.5217 1.3883 1.4248 1.5454 1.5766 4.7593 1.2116 2.9620 1.1703 1.0811 1.0806 1.0949 1.0832 1.0805 1.0737 1.0604 2.7187 7.1775 6.4844 1.0808 1.0798 1.0646 1.0719 1.0666 1.0706 1.0607 1.0512 1.0810 1.0512 1.0938 1.0623 1.0962 1.1014 1.1022 1.1024 1.1021 1.1001 1.0992 1.0891 1.0915 1.0934 1.0660 1.0662 1.0663
irintensity: 0.2164 0.3495 0.1701 1.1291 0.7072 11.6746 0.8266 6.8927 48.1516 0.0574 8.3647 34.6504 5.7189 11.8706 4.8214 18.2006 0.8879 15.8821 27.1321 7.3299 88.8702 17.1251 34.3605 143.3779 13.8705 7.5051 26.4504 27.3227 1.5286 2.0998 3.5802 7.0508 7.7506 5.0852 0.4982 12.5637 1.3967 10.2160 2.0059 4.3064 1.7752 47.3281 3.5905 14.4968 3.1496 219.9323 70.4054 163.4013 40.9500 2.0589 25.0957 3.4984 55.8668 33.3262 10.6281 79.6036 0.7637 0.9550 51.7000 146.3705 24.9111 27.1647 8.9233 7.5811 22.2702 63.5913 7.7352 6.0950 14.1384 22.3727 163.3389 12.0024 19.7508 29.4124 4.1353 17.3694 84.7273 10.5439 4.5196 62.3212 0.8996 4.6251 0.2571 9.4445 4.6207 9.1642 1.0803 32.5714 2.7835 1.6750 19.9386 7.4887 0.8278 0.3294 6.6015 6.5671 1.4696 1.6204 3.6050 5.5971 1.0614 4.4272 18.1258 25.7183 6.3096 7.3604 2.9265 7.7698 9.5282 12.3904 4.4127 10.3125 5.4799 104.0437 28.7375 50.9671 8.8344 24.1471 27.4222 8.0683 27.5957 46.4525 28.7252 22.5240 13.2043 33.7274 37.1388 24.6061 28.1519 45.4671 60.9661 15.8744 46.3967 19.6573 27.1114 21.6229 11.6202 14.1089 38.5964 85.4751 62.1624
temp: 298.150 k
press: 1.00000 atm
elementType: 15 8 8 8 8 8 6 6 6 6 6 6 6 6 6 6 6 6 6 6 6 6 6 6 1 1 1 1 1 1 1 1 1 1 1 1 1 1 1 1 1 1 1 1 1 1 1 1 1
symmnumber: 1
zpe: 1053853.5 jmol-1
zpe.correction: 0.401392 hartree
zpe.thermalcorrener: 0.425161 hartree
zpe.thermalcorrenthalpy: 0.426105 hartree
zpe.thermalcorrgfe: 0.347132 hartree
zpe.sumelectzpe: -1416.437570 hartree
zpe.sumelectthermal: -1416.413801 hartree
zpe.sumelectthermalent: -1416.412856 hartree
zpe.sumelectthermalfe: -1416.491829 hartree
dipole: 0.1304 -1.0271 -0.7553
dipole: 1.2816
quadrupole: -154.8617 -146.7806 -145.1072
quadrupole: -4.2418 1.4035 0.1236
quadrupole: -5.9452 2.1359 3.8094 -4.2418 1.4035 0.1236
hfenergy: -1416.8389615 hartree
pointgroup: C01 [X(C18H25O5P1)]
dipole: -0.0639413 0.3914464 -0.3113139 debye
polarizability: 313.1046229|-7.2033504|218.1568639|-5.3922116|-4.6530909|154.1175232 unknown
InChI: InChI=1S/C18H25O5P/c1-18-9-8-14-13-5-3-12(19)10-11(13)2-4-15(14)16(18)6-7-17(18)23-24(20,21)22/h3,5,10,14-17,19-21H,2,4,6-9H2,1H3
charge 0 multiplicity 1
49 atoms
P  5.611476 0.598746 -0.174238
O  4.017646 0.598454 0.41608
O  6.238746 1.975654 0.639318
O  5.339965 1.200572 -1.761458
O  6.514264 -0.705305 -0.06076
O  -7.063972 0.624126 0.293124
C  1.568383 0.182781 0.247844
C  0.76184 -1.03619 -0.311493
C  -0.7274 -0.970636 0.067989
C  -1.33191 0.339758 -0.530483
C  2.970178 -0.226616 -0.266056
C  0.989975 1.480277 -0.360486
C  1.614061 -2.273201 0.086184
C  -0.534275 1.602075 -0.088086
C  3.093202 -1.752238 0.030075
C  -1.54355 -2.181971 -0.430809
C  1.579856 0.260831 1.797104
C  -2.844661 0.431916 -0.26981
C  -2.981345 -2.120075 0.123769
C  -3.620156 -0.738403 -0.002305
C  -3.524045 1.674539 -0.344497
C  -5.018386 -0.633325 0.179078
C  -4.918264 1.783486 -0.162667
C  -5.667532 0.614293 0.10165
H  0.807066 -0.956992 -1.423767
H  -0.818525 -0.935767 1.174903
H  -1.194049 0.252276 -1.634618
H  3.046516 -0.020011 -1.352042
H  1.162305 1.474171 -1.45739
H  1.515373 2.367278 0.041821
H  1.450239 -3.12392 -0.597932
H  1.355096 -2.619399 1.104348
H  -0.721752 1.793906 0.986481
H  -0.905729 2.491803 -0.630396
H  3.608488 -1.895707 0.99598
H  3.694232 -2.268209 -0.737948
H  -1.06535 -3.129021 -0.116189
H  -1.560348 -2.177641 -1.54044
H  2.289449 1.042477 2.117864
H  0.584836 0.513067 2.19978
H  1.897635 -0.6889 2.261888
H  -2.962435 -2.401628 1.197628
H  -3.622926 -2.870471 -0.376913
H  -2.960108 2.589231 -0.552374
H  -5.621464 -1.525322 0.381852
H  -5.410392 2.762811 -0.228095
H  6.842222 1.745808 1.391352
H  6.123216 1.14559 -2.364901
H  -7.418786 1.544223 0.215441
