program: Orca
programVersion: 5.0.2
elementType: S P O O O O N C C C C C C C C C C H H H H H H H H H H H H H H H H H H H H
charge: 0
multiplicity: 1
keywords: wb97x-d3
keywords: def2-TZVPP
keywords: def2/J RIJCOSX
keywords: DEFGRID2
keywords: scfconv7
keywords: smallprint printgap noloewdin
keywords: NOSOSCF
formula: C10H20NO4PS
InChI: InChI=1/C10H20NO4PS/c1-6-11-16(17,13-5)15-9(4)7-10(12)14-8(2)3/h7-8,11H,6H2,1-5H3
37 atoms
S  -2.68377 -0.332528 1.724362
P  -2.267922 -0.216923 -0.143703
O  -1.092279 -1.239806 -0.659881
O  3.047595 0.7235 -0.483605
O  -3.391826 -0.669893 -1.190925
O  2.981105 -1.086139 0.83554
N  -1.860193 1.283289 -0.668704
C  4.415492 0.989956 -0.137046
C  -1.748667 2.467458 0.173177
C  0.13945 -1.302547 -0.054412
C  4.629026 2.474215 -0.359633
C  5.345868 0.138033 -0.982472
C  -0.372427 2.657773 0.785707
C  1.064873 -0.419022 -0.445365
C  2.443737 -0.339064 0.058166
C  0.250446 -2.403085 0.935495
C  -3.994099 -1.953223 -1.083221
H  4.567563 0.753296 0.919064
H  -2.498009 2.399227 0.960814
H  -2.020722 3.327917 -0.440075
H  -1.607383 1.392365 -1.63859
H  4.483648 2.745888 -1.406098
H  5.647154 2.747654 -0.082796
H  3.947339 3.069989 0.24745
H  5.190309 -0.924757 -0.804904
H  6.383483 0.36514 -0.735385
H  5.203524 0.339989 -2.0451
H  -0.341048 3.580522 1.366497
H  -0.135057 1.830787 1.454254
H  0.407947 2.712091 0.025814
H  0.793695 0.312441 -1.194097
H  1.25177 -2.491508 1.338776
H  -0.032398 -3.347008 0.465684
H  -0.454625 -2.226463 1.750521
H  -3.318032 -2.736346 -1.428467
H  -4.292628 -2.164002 -0.05467
H  -4.879491 -1.942281 -1.714313
totalener: -1488.51118436 hartree
nucrepener: 1622.11252279 hartree
electener: -3110.62370715 hartree
oneelecener: -5269.28402285 hartree
twoeener: 2158.66031570 hartree
kineticenergy: 1483.80075784 hartree
xcener: -107.361088095372 hartree
chargesum: -0.0000000
charge: -0.399273 0.663269 -0.347460 -0.278833 -0.323589 -0.399347 -0.256747 0.144770 -0.028999 0.284670 -0.231968 -0.258270 -0.211966 -0.327156 0.464101 -0.221752 -0.121791 0.061454 0.091366 0.082496 0.127261 0.081020 0.079714 0.089942 0.104336 0.081440 0.081685 0.090752 0.083527 0.060616 0.097602 0.116629 0.089139 0.102122 0.110921 0.102945 0.115375
qa: -0.3993 0.6633 -0.3475 -0.2788 -0.3236 -0.3993 -0.2567 0.1448 -0.0290 0.2847 -0.2320 -0.2583 -0.2120 -0.3272 0.4641 -0.2218 -0.1218 0.0615 0.0914 0.0825 0.1273 0.0810 0.0797 0.0899 0.1043 0.0814 0.0817 0.0908 0.0835 0.0606 0.0976 0.1166 0.0891 0.1021 0.1109 0.1029 0.1154
va: 2.0321 5.4956 2.0843 2.1252 2.1296 2.0995 3.1102 3.8546 3.8848 3.6743 3.9259 3.9125 3.8737 3.9569 4.1448 3.9536 3.8711 1.0239 1.0243 0.9984 1.0454 1.0091 1.0094 1.0099 1.0165 1.0092 1.0084 1.0138 1.0172 1.0120 1.0414 1.0346 1.0042 1.0206 0.9915 1.0073 0.9914
dispcorr: -0.017653132 hartree
energy: -1488.528837496550
dipole: 18.83506 -18.66325 0.17182 9.20390 -8.55182 0.65208 -2.84771 1.63901 -1.20869
magnitude: 1.38407 au
magnitude: 3.51804 debye
