program: Orca
programVersion: 5.0.2
elementType: S P O O O O N C C C C C C C C C C H H H H H H H H H H H H H H H H H H H H
charge: 0
multiplicity: 1
keywords: wb97x-d3
keywords: def2-TZVPP
keywords: def2/J RIJCOSX
keywords: DEFGRID2
keywords: scfconv7
keywords: smallprint printgap noloewdin
keywords: NOSOSCF
formula: C10H20NO4PS
InChI: InChI=1/C10H20NO4PS/c1-6-11-16(17,13-5)15-9(4)7-10(12)14-8(2)3/h7-8,11H,6H2,1-5H3
37 atoms
S  -1.339762 2.534538 -0.867435
P  -1.897937 0.765667 -0.395957
O  -1.16072 -0.49867 -1.111999
O  3.107754 0.158935 0.599703
O  -1.671837 0.326194 1.133767
O  2.995775 -1.655574 -0.703698
N  -3.484021 0.470273 -0.751603
C  4.484884 -0.09602 0.91216
C  -4.110998 -0.845561 -0.84715
C  0.128237 -0.934035 -1.022149
C  4.589997 -1.123259 2.026435
C  5.086329 1.239756 1.302161
C  -4.068137 -1.637698 0.447145
C  1.073327 -0.254129 -0.36105
C  2.467283 -0.692244 -0.206238
C  0.26199 -2.22257 -1.756525
C  -2.033016 1.222708 2.174497
H  4.989264 -0.478029 0.020863
H  -3.67372 -1.435372 -1.658208
H  -5.152421 -0.666387 -1.116758
H  -3.871633 1.172603 -1.361619
H  5.637259 -1.284821 2.283969
H  4.172013 -2.083648 1.729467
H  4.074035 -0.779501 2.924172
H  4.602576 1.650026 2.189374
H  4.995233 1.967266 0.49608
H  6.146326 1.118055 1.524568
H  -4.64974 -2.552284 0.332573
H  -3.055965 -1.926405 0.72316
H  -4.49556 -1.06582 1.270219
H  0.833312 0.688331 0.111647
H  1.274214 -2.605123 -1.724726
H  -0.031289 -2.08353 -2.798701
H  -0.414706 -2.965023 -1.329106
H  -3.109935 1.400499 2.189135
H  -1.736862 0.75533 3.110006
H  -1.518411 2.17823 2.067084
totalener: -1488.51125780 hartree
nucrepener: 1610.66247833 hartree
electener: -3099.17373613 hartree
oneelecener: -5246.40867806 hartree
twoeener: 2147.23494193 hartree
kineticenergy: 1483.79466169 hartree
xcener: -107.359809485113 hartree
chargesum: 0.0000000
charge: -0.371817 0.562127 -0.293497 -0.272857 -0.308255 -0.410822 -0.251079 0.143210 -0.042468 0.273785 -0.259584 -0.228277 -0.240997 -0.222199 0.422927 -0.250996 -0.118489 0.059960 0.089681 0.082046 0.143761 0.079793 0.102542 0.081354 0.080447 0.093076 0.075340 0.088982 0.085978 0.077360 0.082911 0.124805 0.094166 0.088166 0.102703 0.118942 0.117276
qa: -0.3718 0.5621 -0.2935 -0.2729 -0.3083 -0.4108 -0.2511 0.1432 -0.0425 0.2738 -0.2596 -0.2283 -0.2410 -0.2222 0.4229 -0.2510 -0.1185 0.0600 0.0897 0.0820 0.1438 0.0798 0.1025 0.0814 0.0804 0.0931 0.0753 0.0890 0.0860 0.0774 0.0829 0.1248 0.0942 0.0882 0.1027 0.1189 0.1173
va: 2.0936 5.5419 2.1695 2.1402 2.0460 2.0876 3.0801 3.8583 3.9315 3.7207 3.9082 3.9284 3.9140 3.8150 4.2592 3.9418 3.8518 1.0244 0.9965 0.9945 1.0384 1.0094 1.0174 1.0085 1.0095 1.0113 1.0078 1.0105 1.0127 1.0092 1.0680 1.0378 1.0039 1.0020 0.9972 0.9900 1.0090
dispcorr: -0.016744158 hartree
energy: -1488.528001962065
dipole: 6.37283 -7.53319 -1.16037 -9.95825 9.43781 -0.52043 11.23695 -10.50256 0.73439
magnitude: 1.46855 au
magnitude: 3.73276 debye
