program: Orca
programVersion: 5.0.2
elementType: S P O O O O N C C C C C C C C C C H H H H H H H H H H H H H H H H H H H H
charge: 0
multiplicity: 1
keywords: wb97x-d3
keywords: def2-TZVPP
keywords: def2/J RIJCOSX
keywords: DEFGRID2
keywords: scfconv7
keywords: smallprint printgap noloewdin
keywords: NOSOSCF
formula: C10H20NO4PS
InChI: InChI=1/C10H20NO4PS/c1-6-11-16(17,13-5)15-9(4)7-10(12)14-8(2)3/h7-8,11H,6H2,1-5H3
37 atoms
S  -1.301944 2.545159 -0.761647
P  -1.893076 0.767013 -0.37309
O  -1.159225 -0.475533 -1.13059
O  3.101435 0.123002 0.623252
O  -1.697679 0.254766 1.138293
O  3.006911 -1.619079 -0.777278
N  -3.476904 0.513184 -0.768224
C  4.484521 -0.126072 0.913954
C  -4.122849 -0.784452 -0.945152
C  0.134831 -0.899866 -1.068452
C  4.617387 -1.228035 1.951088
C  5.058912 1.190769 1.398546
C  -4.092659 -1.65594 0.297035
C  1.069604 -0.260229 -0.354018
C  2.468962 -0.690077 -0.2274
C  0.287255 -2.125584 -1.900047
C  -2.068596 1.100585 2.21702
H  4.993177 -0.431672 -0.004163
H  -3.693285 -1.328744 -1.791412
H  -5.161298 -0.573503 -1.203027
H  -3.843364 1.253737 -1.345422
H  4.095756 -0.962357 2.871894
H  5.669081 -1.381819 2.195506
H  4.222165 -2.174314 1.585959
H  6.121361 1.075285 1.613195
H  4.566949 1.526092 2.312435
H  4.952678 1.972448 0.646656
H  -4.510397 -1.129679 1.154733
H  -4.689982 -2.551391 0.125942
H  -3.085699 -1.979009 0.553019
H  0.81772 0.641552 0.186601
H  1.304549 -2.495763 -1.895203
H  -0.006252 -1.908186 -2.928799
H  -0.38003 -2.908437 -1.534251
H  -1.77239 0.592661 3.132148
H  -1.559814 2.064089 2.155784
H  -3.147482 1.269447 2.235008
totalener: -1488.51138541 hartree
nucrepener: 1610.50942101 hartree
electener: -3099.02080643 hartree
oneelecener: -5246.11724075 hartree
twoeener: 2147.09643432 hartree
kineticenergy: 1483.79074696 hartree
xcener: -107.359099590219 hartree
chargesum: -0.0000000
charge: -0.370999 0.561137 -0.292289 -0.272591 -0.307766 -0.411006 -0.251906 0.143487 -0.041224 0.273482 -0.260147 -0.229468 -0.241617 -0.219851 0.421597 -0.250229 -0.117421 0.060164 0.089239 0.082021 0.143885 0.081341 0.079667 0.103094 0.075171 0.081000 0.093271 0.077099 0.088932 0.086550 0.081318 0.124525 0.093811 0.088170 0.118915 0.116383 0.102254
qa: -0.3710 0.5611 -0.2923 -0.2726 -0.3078 -0.4110 -0.2519 0.1435 -0.0412 0.2735 -0.2601 -0.2295 -0.2416 -0.2199 0.4216 -0.2502 -0.1174 0.0602 0.0892 0.0820 0.1439 0.0813 0.0797 0.1031 0.0752 0.0810 0.0933 0.0771 0.0889 0.0866 0.0813 0.1245 0.0938 0.0882 0.1189 0.1164 0.1023
va: 2.0941 5.5421 2.1717 2.1403 2.0469 2.0879 3.0801 3.8580 3.9306 3.7193 3.9062 3.9287 3.9145 3.8105 4.2623 3.9416 3.8513 1.0237 0.9963 0.9943 1.0385 1.0084 1.0094 1.0178 1.0078 1.0094 1.0112 1.0090 1.0104 1.0128 1.0684 1.0378 1.0039 1.0023 0.9898 1.0093 0.9971
dispcorr: -0.016718996 hartree
energy: -1488.528104410924
dipole: 6.22108 -7.40799 -1.18691 -10.24963 9.72350 -0.52613 10.52608 -9.84352 0.68256
magnitude: 1.46678 au
magnitude: 3.72827 debye
