program: Orca
programVersion: 5.0.2
elementType: S P O O O O N C C C C C C C C C C H H H H H H H H H H H H H H H H H H H H
charge: 0
multiplicity: 1
keywords: wb97x-d3
keywords: def2-TZVPP
keywords: def2/J RIJCOSX
keywords: DEFGRID2
keywords: scfconv7
keywords: smallprint printgap noloewdin
keywords: NOSOSCF
formula: C10H20NO4PS
InChI: InChI=1/C10H20NO4PS/c1-6-11-16(17,13-5)15-9(4)7-10(12)14-8(2)3/h7-8,11H,6H2,1-5H3
37 atoms
S  -3.14623 -1.641834 1.609704
P  -2.425718 -0.651732 0.137883
O  -0.847821 -0.805591 -0.229967
O  3.510326 0.332704 -0.767525
O  -2.891909 -1.103082 -1.330191
O  2.945848 0.491444 1.392832
N  -2.709753 0.968193 0.260613
C  4.871639 0.692608 -0.488304
C  -2.319887 1.987215 -0.700602
C  0.233449 -0.369498 0.477168
C  5.420337 1.307218 -1.760736
C  5.657435 -0.531738 -0.051972
C  -1.300804 2.968297 -0.145857
C  1.331809 -0.155005 -0.262402
C  2.646251 0.252097 0.248918
C  0.082167 -0.230215 1.950114
C  -4.272191 -1.335367 -1.564964
H  4.887571 1.435948 0.312754
H  -3.212329 2.522057 -1.036519
H  -1.917319 1.491022 -1.583835
H  -3.198391 1.26964 1.087925
H  5.411073 0.592532 -2.584685
H  6.451656 1.623414 -1.604123
H  4.845239 2.182932 -2.061018
H  5.264388 -0.952288 0.872328
H  6.69908 -0.261804 0.125154
H  5.638134 -1.303585 -0.822794
H  -1.677538 3.472261 0.745302
H  -0.369678 2.466399 0.116046
H  -1.071753 3.736885 -0.884458
H  1.261829 -0.318523 -1.330122
H  1.024632 0.037399 2.411926
H  -0.285404 -1.161699 2.381352
H  -0.65267 0.540092 2.192199
H  -4.649714 -2.142176 -0.935608
H  -4.869381 -0.438336 -1.384455
H  -4.368522 -1.616736 -2.610885
totalener: -1488.51078512 hartree
nucrepener: 1589.88960065 hartree
electener: -3078.40038577 hartree
oneelecener: -5204.61422829 hartree
twoeener: 2126.21384252 hartree
kineticenergy: 1483.79621524 hartree
xcener: -107.363173238716 hartree
chargesum: -0.0000000
charge: -0.385280 0.589017 -0.270593 -0.275666 -0.310816 -0.410977 -0.258992 0.144582 -0.031434 0.173295 -0.227087 -0.258461 -0.238613 -0.273755 0.461414 -0.234411 -0.127012 0.060036 0.091702 0.091363 0.148427 0.082330 0.076504 0.088870 0.103115 0.079589 0.083123 0.075385 0.088901 0.086808 0.114975 0.130951 0.118365 0.083058 0.115525 0.097346 0.118416
qa: -0.3853 0.5890 -0.2706 -0.2757 -0.3108 -0.4110 -0.2590 0.1446 -0.0314 0.1733 -0.2271 -0.2585 -0.2386 -0.2738 0.4614 -0.2344 -0.1270 0.0600 0.0917 0.0914 0.1484 0.0823 0.0765 0.0889 0.1031 0.0796 0.0831 0.0754 0.0889 0.0868 0.1150 0.1310 0.1184 0.0831 0.1155 0.0973 0.1184
va: 2.0656 5.5290 2.1720 2.1358 2.0947 2.0848 3.0240 3.8540 3.8684 3.7665 3.9253 3.9139 3.9352 3.8282 4.1568 3.8903 3.8734 1.0251 0.9970 1.0108 1.0379 1.0095 1.0082 1.0114 1.0160 1.0091 1.0083 1.0058 1.0070 1.0133 1.0367 1.0409 1.0100 1.0162 1.0052 0.9907 0.9917
dispcorr: -0.017098402 hartree
energy: -1488.527883520532
dipole: 16.98873 -17.34050 -0.35176 13.50548 -12.23121 1.27427 -7.02473 5.93233 -1.09240
magnitude: 1.71489 au
magnitude: 4.35889 debye
