program: Orca
programVersion: 5.0.2
elementType: S P O O O O N C C C C C C C C C C H H H H H H H H H H H H H H H H H H H H
charge: 0
multiplicity: 1
keywords: wb97x-d3
keywords: def2-TZVPP
keywords: def2/J RIJCOSX
keywords: DEFGRID2
keywords: scfconv7
keywords: smallprint printgap noloewdin
keywords: NOSOSCF
formula: C10H20NO4PS
InChI: InChI=1/C10H20NO4PS/c1-6-11-16(17,13-5)15-9(4)7-10(12)14-8(2)3/h7-8,11H,6H2,1-5H3
37 atoms
S  -1.504083 0.857971 2.154804
P  -2.066599 0.314825 0.408338
O  -1.01471 0.449933 -0.823161
O  3.37896 0.192097 0.517888
O  -2.415582 -1.248979 0.223031
O  2.837629 -1.530703 -0.805265
N  -3.378315 1.141501 -0.1444
C  4.741058 -0.250972 0.623066
C  -3.941778 1.040138 -1.481976
C  0.155344 -0.271058 -0.927024
C  5.289731 0.370588 1.891958
C  5.532117 0.158813 -0.607049
C  -3.460829 2.123741 -2.433503
C  1.197091 0.105755 -0.180548
C  2.527624 -0.524013 -0.218184
C  0.066947 -1.347768 -1.947932
C  -3.216619 -1.894285 1.203491
H  4.754348 -1.340497 0.71332
H  -5.030301 1.072742 -1.395563
H  -3.702596 0.053308 -1.878922
H  -3.592261 1.979561 0.373339
H  6.321026 0.052179 2.044489
H  4.713193 0.067909 2.765588
H  5.280594 1.459893 1.836664
H  5.519354 1.242026 -0.737184
H  5.143134 -0.307094 -1.51064
H  6.57178 -0.151842 -0.497268
H  -3.708665 3.117804 -2.058316
H  -2.382434 2.075687 -2.573087
H  -3.936474 2.014269 -3.408577
H  1.076222 0.942254 0.49506
H  -0.339027 -0.94099 -2.875902
H  -0.621496 -2.123381 -1.608018
H  1.029672 -1.802807 -2.145604
H  -2.745955 -1.8501 2.186238
H  -4.208927 -1.443125 1.265594
H  -3.318079 -2.932318 0.8960
totalener: -1488.51277576 hartree
nucrepener: 1594.73840915 hartree
electener: -3083.25118491 hartree
oneelecener: -5214.74375663 hartree
twoeener: 2131.49257171 hartree
kineticenergy: 1483.79202827 hartree
xcener: -107.356628871850 hartree
chargesum: 0.0000000
charge: -0.383563 0.605447 -0.331140 -0.269762 -0.321802 -0.406010 -0.248242 0.143443 -0.035129 0.254599 -0.228185 -0.260286 -0.230450 -0.252516 0.435766 -0.241155 -0.115295 0.060466 0.089567 0.083265 0.139281 0.075138 0.093774 0.082318 0.082594 0.102686 0.079784 0.070386 0.088854 0.080243 0.120630 0.088461 0.098522 0.119607 0.114245 0.102198 0.112262
qa: -0.3836 0.6054 -0.3311 -0.2698 -0.3218 -0.4060 -0.2482 0.1434 -0.0351 0.2546 -0.2282 -0.2603 -0.2305 -0.2525 0.4358 -0.2412 -0.1153 0.0605 0.0896 0.0833 0.1393 0.0751 0.0938 0.0823 0.0826 0.1027 0.0798 0.0704 0.0889 0.0802 0.1206 0.0885 0.0985 0.1196 0.1142 0.1022 0.1123
va: 2.0838 5.5293 2.0986 2.1469 2.0572 2.0891 3.0749 3.8582 3.9084 3.6825 3.9276 3.9058 3.9265 3.9573 4.1901 3.9519 3.8671 1.0229 0.9952 1.0119 1.0411 1.0077 1.0112 1.0097 1.0083 1.0184 1.0094 1.0066 1.0135 1.0109 1.0368 1.0031 1.0114 1.0340 1.0057 0.9933 0.9913
dispcorr: -0.016387565 hartree
energy: -1488.529163327104
dipole: 8.39731 -9.41764 -1.02033 -0.13379 0.23041 0.09662 -8.58413 7.90015 -0.68398
magnitude: 1.23217 au
magnitude: 3.13192 debye
