program: Orca
programVersion: 5.0.2
elementType: S P O O O O N C C C C C C C C C C H H H H H H H H H H H H H H H H H H H H
charge: 0
multiplicity: 1
keywords: wb97x-d3
keywords: def2-TZVPP
keywords: def2/J RIJCOSX
keywords: DEFGRID2
keywords: scfconv7
keywords: smallprint printgap noloewdin
keywords: NOSOSCF
formula: C10H20NO4PS
InChI: InChI=1/C10H20NO4PS/c1-6-11-16(17,13-5)15-9(4)7-10(12)14-8(2)3/h7-8,11H,6H2,1-5H3
37 atoms
S  -1.594519 -0.419567 2.397073
P  -2.093531 0.02179 0.60588
O  -1.350077 -0.856575 -0.563048
O  3.00116 0.527067 0.246419
O  -3.598943 -0.285837 0.145916
O  2.935122 -1.40672 -0.877738
N  -1.88521 1.608151 0.207723
C  4.435848 0.52609 0.256749
C  -2.470526 2.29753 -0.939808
C  -0.020794 -1.107502 -0.714138
C  4.84975 1.382424 1.436984
C  4.975293 1.056646 -1.060036
C  -2.065788 1.705455 -2.277528
C  0.914514 -0.282686 -0.224903
C  2.363877 -0.488349 -0.343823
C  0.1723 -2.366084 -1.484206
C  -4.158035 -1.58043 0.328051
H  4.790524 -0.497132 0.405396
H  -2.113933 3.326492 -0.886456
H  -3.560786 2.335493 -0.863129
H  -1.721071 2.182818 1.019229
H  4.447584 0.991712 2.371325
H  4.507614 2.411742 1.320962
H  5.936399 1.398557 1.521146
H  6.064921 1.090404 -1.028218
H  4.615195 2.069043 -1.249859
H  4.689672 0.421257 -1.896638
H  -0.982012 1.633197 -2.363414
H  -2.490261 0.715799 -2.435938
H  -2.428501 2.34594 -3.08145
H  0.616512 0.608992 0.308223
H  -0.391301 -2.319963 -2.41779
H  -0.222323 -3.208333 -0.91189
H  1.215346 -2.553501 -1.70521
H  -3.775801 -2.281673 -0.414852
H  -3.94553 -1.964603 1.3274
H  -5.234207 -1.483708 0.206029
totalener: -1488.51155203 hartree
nucrepener: 1617.15398938 hartree
electener: -3105.66554141 hartree
oneelecener: -5259.43716571 hartree
twoeener: 2153.77162430 hartree
kineticenergy: 1483.79654898 hartree
xcener: -107.360450155160 hartree
chargesum: 0.0000000
charge: -0.360445 0.585152 -0.313498 -0.273483 -0.313543 -0.409889 -0.258423 0.142434 -0.035069 0.265069 -0.229857 -0.259156 -0.251753 -0.225107 0.433761 -0.247193 -0.117407 0.060791 0.079868 0.089493 0.145539 0.093977 0.079698 0.075718 0.080225 0.080435 0.103124 0.084856 0.086135 0.091913 0.080827 0.089847 0.093904 0.122015 0.110444 0.105637 0.113961
qa: -0.3604 0.5852 -0.3135 -0.2735 -0.3135 -0.4099 -0.2584 0.1424 -0.0351 0.2651 -0.2299 -0.2592 -0.2518 -0.2251 0.4338 -0.2472 -0.1174 0.0608 0.0799 0.0895 0.1455 0.0940 0.0797 0.0757 0.0802 0.0804 0.1031 0.0849 0.0861 0.0919 0.0808 0.0898 0.0939 0.1220 0.1104 0.1056 0.1140
va: 2.1051 5.5157 2.1110 2.1386 2.0943 2.0902 3.0524 3.8576 3.9252 3.6849 3.9283 3.9060 3.9126 3.8075 4.2319 3.9472 3.8598 1.0239 0.9936 0.9969 1.0370 1.0113 1.0095 1.0079 1.0094 1.0087 1.0177 1.0085 1.0133 1.0111 1.0795 1.0036 1.0046 1.0373 0.9911 1.0098 0.9912
dispcorr: -0.017048500 hartree
energy: -1488.528600526481
dipole: 11.85569 -12.57627 -0.72058 6.84897 -5.99678 0.85220 -11.40648 10.60262 -0.80386
magnitude: 1.37538 au
magnitude: 3.49593 debye
