program: Orca
programVersion: 5.0.2
elementType: S P O O O O N C C C C C C C C C C H H H H H H H H H H H H H H H H H H H H
charge: 0
multiplicity: 1
keywords: wb97x-d3
keywords: def2-TZVPP
keywords: def2/J RIJCOSX
keywords: DEFGRID2
keywords: scfconv7
keywords: smallprint printgap noloewdin
keywords: NOSOSCF
formula: C10H20NO4PS
InChI: InChI=1/C10H20NO4PS/c1-6-11-16(17,13-5)15-9(4)7-10(12)14-8(2)3/h7-8,11H,6H2,1-5H3
37 atoms
S  -1.482088 0.168852 2.368281
P  -2.01595 0.089065 0.535266
O  -1.284601 -1.058109 -0.383249
O  3.040071 0.58476 0.010081
O  -3.524466 -0.360761 0.225364
O  2.997608 -1.441265 -0.939817
N  -1.828406 1.484607 -0.3087
C  4.47388 0.621703 -0.021111
C  -2.179205 1.692995 -1.705104
C  0.045526 -1.257796 -0.592294
C  5.041321 -0.126014 1.172959
C  4.862113 2.087224 -0.020434
C  -3.534785 2.351525 -1.900609
C  0.969913 -0.349492 -0.251691
C  2.416884 -0.504948 -0.448796
C  0.254248 -2.583474 -1.236959
C  -4.050189 -1.565322 0.766362
H  4.824668 0.150805 -0.943044
H  -2.153671 0.728643 -2.212248
H  -1.392935 2.29435 -2.166472
H  -1.703336 2.308146 0.258492
H  6.130251 -0.066883 1.165997
H  4.768707 -1.179962 1.153246
H  4.687272 0.308193 2.108991
H  4.446119 2.609871 -0.881642
H  5.946985 2.182964 -0.063815
H  4.517423 2.588851 0.8847
H  -3.737669 2.498497 -2.961891
H  -4.330901 1.737999 -1.482409
H  -3.573411 3.330416 -1.420755
H  0.670471 0.574068 0.222631
H  -0.095843 -3.373408 -0.569516
H  1.295307 -2.761081 -1.474496
H  -0.338628 -2.649994 -2.15097
H  -5.130431 -1.522726 0.648503
H  -3.666965 -2.435833 0.232126
H  -3.809951 -1.659231 1.826933
totalener: -1488.51385904 hartree
nucrepener: 1604.81032202 hartree
electener: -3093.32418107 hartree
oneelecener: -5234.72259723 hartree
twoeener: 2141.39841616 hartree
kineticenergy: 1483.79845320 hartree
xcener: -107.361449654483 hartree
chargesum: 0.0000000
charge: -0.361871 0.587650 -0.311946 -0.273894 -0.313717 -0.409760 -0.246609 0.141829 -0.037930 0.262861 -0.256510 -0.230788 -0.226893 -0.218145 0.421126 -0.244430 -0.115280 0.060177 0.082058 0.091917 0.140253 0.078313 0.102544 0.084986 0.088397 0.076113 0.083219 0.080365 0.088588 0.070341 0.077651 0.092858 0.123274 0.088512 0.111297 0.109768 0.103677
qa: -0.3619 0.5876 -0.3119 -0.2739 -0.3137 -0.4098 -0.2466 0.1418 -0.0379 0.2629 -0.2565 -0.2308 -0.2269 -0.2181 0.4211 -0.2444 -0.1153 0.0602 0.0821 0.0919 0.1403 0.0783 0.1025 0.0850 0.0884 0.0761 0.0832 0.0804 0.0886 0.0703 0.0777 0.0929 0.1233 0.0885 0.1113 0.1098 0.1037
va: 2.0946 5.5269 2.1419 2.1371 2.1028 2.0908 3.0621 3.8549 3.9050 3.7061 3.9129 3.9285 3.9315 3.7909 4.2478 3.9450 3.8647 1.0245 1.0127 0.9938 1.0405 1.0088 1.0168 1.0082 1.0110 1.0084 1.0093 1.0109 1.0146 1.0059 1.0812 1.0042 1.0374 1.0042 0.9911 0.9910 1.0090
dispcorr: -0.016410093 hartree
energy: -1488.530269134730
dipole: 9.31197 -10.02519 -0.71322 5.03344 -4.47635 0.55709 -8.66991 7.75089 -0.91902
magnitude: 1.28982 au
magnitude: 3.27846 debye
