program: Orca
programVersion: 5.0.2
elementType: S P O O O O N C C C C C C C C C C H H H H H H H H H H H H H H H H H H H H
charge: 0
multiplicity: 1
keywords: wb97x-d3
keywords: def2-TZVPP
keywords: def2/J RIJCOSX
keywords: DEFGRID2
keywords: scfconv7
keywords: smallprint printgap noloewdin
keywords: NOSOSCF
formula: C10H20NO4PS
InChI: InChI=1/C10H20NO4PS/c1-6-11-16(17,13-5)15-9(4)7-10(12)14-8(2)3/h7-8,11H,6H2,1-5H3
37 atoms
S  -2.434988 -1.02545 1.985863
P  -2.193687 -0.146171 0.302356
O  -0.680935 0.244727 -0.14446
O  3.841627 0.571371 0.055096
O  -2.62279 -0.952476 -1.024907
O  3.247915 -1.566412 -0.244398
N  -2.985563 1.29337 0.193201
C  5.236695 0.235317 0.033953
C  -2.884807 2.216211 -0.927295
C  0.448063 -0.527109 -0.157346
C  5.950191 1.338253 0.790671
C  5.729965 0.107482 -1.396827
C  -4.227935 2.847843 -1.244564
C  1.592312 0.161012 -0.044727
C  2.944364 -0.408533 -0.094046
C  0.273754 -1.993196 -0.331708
C  -3.906985 -1.560644 -1.064465
H  5.381999 -0.716215 0.551931
H  -2.526527 1.66568 -1.796512
H  -2.138601 2.989326 -0.724066
H  -3.248792 1.694305 1.080117
H  7.018016 1.123642 0.8380
H  5.581334 1.423899 1.812615
H  5.824894 2.304006 0.299009
H  5.582117 1.038633 -1.945987
H  5.2217 -0.696146 -1.927145
H  6.797213 -0.117281 -1.402111
H  -4.136645 3.542344 -2.079574
H  -4.962081 2.088313 -1.510989
H  -4.618366 3.408027 -0.39385
H  1.52854 1.23342 0.085265
H  1.233531 -2.49419 -0.360161
H  -0.264537 -2.204258 -1.2563
H  -0.312783 -2.406355 0.491113
H  -4.701799 -0.820517 -0.950585
H  -4.001658 -2.036309 -2.037575
H  -4.010211 -2.312161 -0.280483
totalener: -1488.51303234 hartree
nucrepener: 1565.36805378 hartree
electener: -3053.88108612 hartree
oneelecener: -5155.74786881 hartree
twoeener: 2101.86678269 hartree
kineticenergy: 1483.79451324 hartree
xcener: -107.359604433029 hartree
chargesum: -0.0000000
charge: -0.376038 0.580502 -0.281050 -0.276956 -0.321954 -0.411240 -0.249799 0.145023 -0.037133 0.235605 -0.228378 -0.259722 -0.225381 -0.278917 0.448961 -0.248184 -0.113822 0.060407 0.086899 0.089814 0.139383 0.076009 0.091753 0.080418 0.080725 0.103383 0.080069 0.082859 0.077578 0.073633 0.107436 0.126967 0.104066 0.105945 0.099490 0.117147 0.114501
qa: -0.3760 0.5805 -0.2811 -0.2770 -0.3220 -0.4112 -0.2498 0.1450 -0.0371 0.2356 -0.2284 -0.2597 -0.2254 -0.2789 0.4490 -0.2482 -0.1138 0.0604 0.0869 0.0898 0.1394 0.0760 0.0918 0.0804 0.0807 0.1034 0.0801 0.0829 0.0776 0.0736 0.1074 0.1270 0.1041 0.1059 0.0995 0.1171 0.1145
va: 2.0724 5.5324 2.1536 2.1341 2.0505 2.0853 3.0783 3.8566 3.9044 3.7419 3.9256 3.9099 3.9451 3.8970 4.1691 3.8800 3.8592 1.0241 1.0105 0.9970 1.0399 1.0081 1.0115 1.0095 1.0084 1.0174 1.0091 1.0106 1.0061 1.0046 1.0369 1.0410 1.0082 1.0247 0.9952 0.9910 1.0061
dispcorr: -0.015880324 hartree
energy: -1488.528912666420
dipole: 9.72417 -10.49534 -0.77117 8.86745 -7.70105 1.16641 -10.44977 9.46009 -0.98968
magnitude: 1.71309 au
magnitude: 4.35432 debye
