program: Gaussian 09
title: 000066328
version: EM64L-G09RevD.01
frameworkgroup: C1[X(C7H10O3)]
method: RPBEPBE
basis: SDD
operation: Freq
keyword: #pfreq=noraman
keyword: PBEPBE/SDD
title: #p freq=noraman PBEPBE/SDD
converged: YES YES NO NO
title: Mulliken charges:
elementType: O O O C C C C C C C H H H H H H H H H H
charge: -0.166697 -0.254732 -0.235345 -0.272054 -0.468900 -0.420092 -0.496239 0.135993 0.231411 -0.501233 0.288235 0.248130 0.234504 0.229945 0.215406 0.249717 0.258683 0.235449 0.240326 0.247494
chargesum: 0.00000
title: Mulliken charges with hydrogens summed into heavy atoms:
elementType: O O O C C C C C C C
charge: -0.166697 -0.254732 -0.235345 0.016181 0.013733 0.025259 0.012160 0.135993 0.231411 0.222036
polarizability: 1.01781186e+02 2.81562754e+00 7.66404720e+01 -2.22745891e+00 -1.33162134e+00 6.55683509e+01
1716.lowfreq: -14.7814 -9.8965 -0.0007 -0.0004 -0.0002 1.5786 39.6971 52.7665 83.2869
frequency: 39.3461 52.6528 83.2705 105.5932 160.1235 208.9265 236.7854 294.7714 348.1193 432.9982 481.5213 554.3229 593.0603 635.7011 705.5298 745.8546 828.5526 856.2587 897.3593 915.2506 939.6238 991.7593 1021.3369 1073.2117 1101.0655 1114.1089 1125.5283 1150.3299 1151.7356 1167.3932 1198.6920 1245.8501 1271.2160 1288.1742 1311.3631 1325.2168 1421.6551 1426.6241 1452.3602 1462.8421 1477.4065 1484.1646 1633.2968 1668.7254 2988.5311 3006.2655 3006.9029 3012.2637 3016.0457 3072.9940 3078.3858 3089.9496 3110.1321 3152.7557
redmass: 4.9322 3.1105 1.1237 4.2708 2.7353 4.9833 2.2785 4.2281 4.5209 3.7464 3.7573 3.5020 2.5548 4.9369 5.3818 3.0415 2.0392 5.1693 1.7026 2.3110 2.6395 2.0204 1.9105 1.8995 3.0616 1.3211 3.8333 1.5614 1.5591 1.6172 1.4524 1.3171 1.3655 1.5610 1.3603 1.6073 1.1874 1.0819 1.0501 1.0506 1.0809 1.0942 9.0715 12.3504 1.0659 1.0630 1.0308 1.0744 1.0699 1.0957 1.0998 1.1043 1.1047 1.1049
irintensity: 4.8851 4.5681 0.6689 1.6137 0.0352 6.5495 5.7292 14.8241 3.6228 3.5697 2.6877 6.5229 2.7325 12.6458 3.2332 2.1780 24.2871 10.6929 0.5227 2.9006 39.3913 15.7883 6.1504 4.4712 212.3979 10.3331 29.3857 3.0270 36.9439 77.8354 10.6349 56.2129 2.7889 85.2622 7.7452 33.4533 23.0971 23.9421 14.8024 10.5915 13.9846 7.1240 227.0588 123.9785 8.2677 47.4760 20.0693 1.7894 17.9051 14.7417 19.8577 31.2764 23.6287 15.3993
temp: 298.150 k
press: 1.00000 atm
elementType: 8 8 8 6 6 6 6 6 6 6 1 1 1 1 1 1 1 1 1 1
symmnumber: 1
zpe: 419972.4 jmol-1
zpe.correction: 0.159959 hartree
zpe.thermalcorrener: 0.170286 hartree
zpe.thermalcorrenthalpy: 0.171230 hartree
zpe.thermalcorrgfe: 0.122874 hartree
zpe.sumelectzpe: -497.637326 hartree
zpe.sumelectthermal: -497.626999 hartree
zpe.sumelectthermalent: -497.626055 hartree
zpe.sumelectthermalfe: -497.674411 hartree
dipole: -1.0232 -1.8205 -1.5550
dipole: 2.6037
quadrupole: -44.3043 -66.4341 -60.8835
quadrupole: 2.3941 -1.5239 2.3413
quadrupole: 12.9030 -9.2268 -3.6762 2.3941 -1.5239 2.3413
hfenergy: -497.7972851 hartree
pointgroup: C01 [X(C7H10O3)]
dipole: 0.3053911 0.9422717 -0.2611299 debye
dipolederiv: -0.4687883 -0.144549 -0.0847111 0.051167 -0.9416446 -0.2266296 -0.0496359 -0.1893096 -0.3630838 -1.2778409 -0.1961526 -0.2967082 -0.2797687 -0.3039607 -0.0625048 -0.4416483 -0.0787692 -0.6508369 -0.6686967 -0.022872 0.1532468 -0.1260759 -0.2992293 0.0214167 -0.0405721 -0.1421077 -0.9197976 -0.7756465 0.2484532 0.1099927 0.2665303 -0.2714437 -0.0746437 0.0788152 -0.0083317 0.0356013 0.0297034 0.0346386 0.0210676 0.038036 0.1198037 -0.0557937 0.0941258 0.0347931 0.0741669 0.0310523 0.0010358 0.0161796 0.0164339 0.0658927 0.0025769 -0.0444684 -0.0412803 0.1720183 -0.40765 -0.0869331 -0.1795426 0.0789516 -0.0474542 -0.0291596 -0.1896909 -0.0932651 0.0344902 1.0014136 -0.039003 0.2113956 -0.467899 1.1178996 0.319377 0.2288545 0.2381005 0.2158815 1.6797875 0.1117058 0.0535108 0.3971238 0.1339458 0.0473366 0.3345204 0.2012062 1.2722198 0.6184459 0.0734252 0.0518954 0.0934268 0.2950669 0.014582 -0.0483825 -0.0051977 0.2140443 0.1112762 -0.0036108 -0.0164568 -0.017372 0.0686388 0.009811 -0.0141923 -0.0060805 -0.0368794 0.072005 0.0073448 0.0321677 -0.0015813 0.0919215 0.0399253 0.0124131 -0.0159752 -0.0855524 0.0398848 0.0587996 -0.0135885 0.0366014 -0.1465116 0.0314394 -0.0231427 0.062982 0.0795189 -0.0722929 -0.0801838 -0.0835916 -0.0695807 0.0282672 -0.0489786 -0.1198989 -0.0777294 -0.0014857 0.0505775 -0.0014096 0.0401048 -0.0110628 0.015617 0.0571376 0.1064643 0.0911077 -0.1231602 0.0857991 -0.0272852 0.0144906 -0.0395177 0.0456631 0.0434375 -0.0179595 0.0841704 -0.0401358 -0.0136934 0.0607221 0.060068 0.0460824 0.0058256 -0.062146 0.0887387 -0.0570637 0.0612716 -0.0071353 -0.0289249 -0.0718037 -0.036653 0.1128316 -0.018518 -0.1213815 -0.0292591 -0.0401824 -0.0276021 0.0045553 0.0132527 0.0563321 -0.0368388 -0.0824613 0.1129283 -0.0765507 0.0494753 -0.0005993 0.0302435 -0.0309698 -0.0311739 -0.0542907 0.0737952 0.0541129 0.1085599 0.052426 unknown
polarizability: 101.1016164|4.5422786|74.4203549|2.7509702|5.3622302|68.4680379 unknown
InChI: InChI=1S/C7H10O3/c1-10-7(9)5-3-2-4-6(5)8/h5H,2-4H2,1H3
charge 0 multiplicity 1
20 atoms
O  0.617494 -1.726559 -0.706646
O  -2.207839 0.1537 -0.662643
O  -1.488786 0.407699 1.54059
C  0.100412 0.695568 -0.325497
C  0.960853 1.740647 0.423713
C  2.429278 1.335912 0.109819
C  2.403024 -0.20903 0.126121
C  0.995971 -0.591726 -0.350183
C  -1.249735 0.422826 0.31076
C  -3.547919 -0.233674 -0.156137
H  -0.064113 0.977097 -1.383638
H  0.757977 1.656998 1.507385
H  0.729345 2.773701 0.114972
H  3.139997 1.758722 0.839449
H  2.722329 1.701154 -0.892451
H  2.515752 -0.597386 1.159166
H  3.172467 -0.703651 -0.490557
H  -4.150963 -0.398776 -1.05942
H  -3.969329 0.573893 0.465748
H  -3.471217 -1.154715 0.44505
