program: Orca
programVersion: 5.0.2
elementType: S P O O O O N C C C C C C C C C C H H H H H H H H H H H H H H H H H H H H
charge: 0
multiplicity: 1
keywords: wb97x-d3
keywords: def2-TZVPP
keywords: def2/J RIJCOSX
keywords: DEFGRID2
keywords: scfconv7
keywords: smallprint printgap noloewdin
keywords: NOSOSCF
formula: C10H20NO4PS
InChI: InChI=1/C10H20NO4PS/c1-6-11-16(17,13-5)15-9(4)7-10(12)14-8(2)3/h7-8,11H,6H2,1-5H3
37 atoms
S  -2.696569 -0.967955 2.102162
P  -2.266027 -0.128766 0.436157
O  -0.713084 0.246697 0.137817
O  3.783536 0.547365 -0.353688
O  -2.559049 -0.969157 -0.907707
O  3.19247 -1.596621 -0.10105
N  -3.016335 1.315945 0.214233
C  5.171475 0.195692 -0.452159
C  -2.844273 2.190376 -0.93586
C  0.40628 -0.534228 0.096254
C  5.770192 0.018621 0.932427
C  5.841619 1.311347 -1.229702
C  -4.147898 2.439951 -1.674335
C  1.544897 0.149389 -0.089527
C  2.889489 -0.430891 -0.173285
C  0.23935 -2.0030 0.252958
C  -3.826096 -1.593341 -1.058437
H  5.263596 -0.741505 -1.007154
H  -2.119437 1.740149 -1.61387
H  -2.402609 3.136006 -0.610968
H  -3.448572 1.709216 1.034363
H  6.830119 -0.22431 0.850124
H  5.288567 -0.791289 1.477765
H  5.681687 0.935344 1.517084
H  5.781343 2.261379 -0.697409
H  5.388758 1.440146 -2.212546
H  6.895902 1.077128 -1.376887
H  -4.562894 1.507517 -2.057466
H  -4.895628 2.900324 -1.026984
H  -3.986024 3.109337 -2.519697
H  1.481123 1.225825 -0.18125
H  -0.26063 -2.231593 1.195115
H  1.200184 -2.50214 0.230846
H  -0.380856 -2.404157 -0.54964
H  -4.638264 -0.864577 -1.014644
H  -3.830217 -2.068281 -2.036272
H  -3.988613 -2.346421 -0.286367
totalener: -1488.51230220 hartree
nucrepener: 1567.35861791 hartree
electener: -3055.87092011 hartree
oneelecener: -5159.69690658 hartree
twoeener: 2103.82598647 hartree
kineticenergy: 1483.79390312 hartree
xcener: -107.361766929942 hartree
chargesum: -0.0000000
charge: -0.377287 0.578754 -0.277261 -0.278164 -0.323168 -0.412406 -0.249381 0.146569 -0.030887 0.243418 -0.260347 -0.228363 -0.224989 -0.283068 0.446745 -0.259454 -0.121103 0.059787 0.083507 0.088575 0.144313 0.079697 0.103861 0.081845 0.080626 0.089788 0.076489 0.074104 0.076074 0.084278 0.107624 0.109630 0.128830 0.105531 0.097114 0.120517 0.118197
qa: -0.3773 0.5788 -0.2773 -0.2782 -0.3232 -0.4124 -0.2494 0.1466 -0.0309 0.2434 -0.2603 -0.2284 -0.2250 -0.2831 0.4467 -0.2595 -0.1211 0.0598 0.0835 0.0886 0.1443 0.0797 0.1039 0.0818 0.0806 0.0898 0.0765 0.0741 0.0761 0.0843 0.1076 0.1096 0.1288 0.1055 0.0971 0.1205 0.1182
va: 2.0750 5.5452 2.1737 2.1323 2.0412 2.0838 3.0791 3.8545 3.9036 3.7549 3.9116 3.9250 3.9352 3.8698 4.1723 3.8816 3.8604 1.0248 1.0140 0.9982 1.0388 1.0089 1.0172 1.0084 1.0095 1.0116 1.0081 1.0048 1.0054 1.0118 1.0368 1.0199 1.0419 1.0095 0.9945 0.9897 1.0064
dispcorr: -0.016045767 hartree
energy: -1488.528347968088
dipole: 10.71073 -11.44797 -0.73724 7.65383 -6.54193 1.11190 -10.76387 9.63124 -1.13263
magnitude: 1.75005 au
magnitude: 4.44829 debye
