program: Orca
programVersion: 5.0.2
elementType: S P O O O O N C C C C C C C C C C H H H H H H H H H H H H H H H H H H H H
charge: 0
multiplicity: 1
keywords: wb97x-d3
keywords: def2-TZVPP
keywords: def2/J RIJCOSX
keywords: DEFGRID2
keywords: scfconv7
keywords: smallprint printgap noloewdin
keywords: NOSOSCF
formula: C10H20NO4PS
InChI: InChI=1/C10H20NO4PS/c1-6-11-16(17,13-5)15-9(4)7-10(12)14-8(2)3/h7-8,11H,6H2,1-5H3
37 atoms
S  -2.075224 -0.792339 2.19036
P  -2.095056 -0.102117 0.404938
O  -1.120396 -0.865557 -0.664267
O  3.206351 0.664661 -0.505575
O  -3.455565 -0.23497 -0.436321
O  3.109842 -1.503708 0.047276
N  -1.718326 1.491625 0.293177
C  4.629588 0.701438 -0.322052
C  -1.807092 2.301619 -0.911156
C  0.175728 -1.21485 -0.367971
C  4.962834 0.898146 1.146346
C  5.140363 1.83646 -1.187388
C  -3.111826 3.071775 -1.031393
C  1.119951 -0.276952 -0.496029
C  2.55976 -0.482314 -0.278452
C  0.309988 -2.643411 0.013243
C  -4.067001 -1.506368 -0.611139
H  5.058404 -0.242906 -0.666936
H  -1.673176 1.648159 -1.77383
H  -0.958372 2.989393 -0.920519
H  -1.691312 1.979831 1.174116
H  6.043827 0.959662 1.276522
H  4.604504 0.069228 1.754468
H  4.527092 1.823656 1.525625
H  4.888152 1.682666 -2.2364
H  6.225829 1.900128 -1.111141
H  4.726258 2.795098 -0.871888
H  -3.113698 3.682038 -1.934992
H  -3.962244 2.393911 -1.075065
H  -3.255386 3.740795 -0.181827
H  0.820725 0.719765 -0.791881
H  1.343119 -2.935018 0.156162
H  -0.138526 -3.273403 -0.75722
H  -0.244164 -2.818399 0.938259
H  -5.071112 -1.327935 -0.988332
H  -3.517375 -2.11298 -1.332045
H  -4.132882 -2.045445 0.335779
totalener: -1488.51355309 hartree
nucrepener: 1601.11541987 hartree
electener: -3089.62897296 hartree
oneelecener: -5227.28702723 hartree
twoeener: 2137.65805427 hartree
kineticenergy: 1483.80186515 hartree
xcener: -107.359223006020 hartree
chargesum: -0.0000000
charge: -0.384636 0.615799 -0.346384 -0.277027 -0.311482 -0.400630 -0.247941 0.142907 -0.045510 0.250153 -0.256244 -0.229009 -0.237383 -0.253843 0.441066 -0.225644 -0.115768 0.060279 0.090311 0.095401 0.139205 0.079866 0.105600 0.080990 0.090582 0.077420 0.080192 0.081203 0.090368 0.069844 0.108151 0.118410 0.087618 0.099898 0.112583 0.109945 0.103707
qa: -0.3846 0.6158 -0.3464 -0.2770 -0.3115 -0.4006 -0.2479 0.1429 -0.0455 0.2502 -0.2562 -0.2290 -0.2374 -0.2538 0.4411 -0.2256 -0.1158 0.0603 0.0903 0.0954 0.1392 0.0799 0.1056 0.0810 0.0906 0.0774 0.0802 0.0812 0.0904 0.0698 0.1082 0.1184 0.0876 0.0999 0.1126 0.1099 0.1037
va: 2.0692 5.5168 2.0664 2.1334 2.0921 2.0994 3.0853 3.8566 3.8841 3.7177 3.9107 3.9268 3.9564 3.9367 4.2039 3.9454 3.8627 1.0242 1.0091 0.9919 1.0413 1.0091 1.0164 1.0086 1.0110 1.0084 1.0095 1.0101 1.0135 1.0063 1.0287 1.0358 1.0040 1.0202 0.9918 0.9918 1.0084
dispcorr: -0.016647185 hartree
energy: -1488.530200274412
dipole: 11.65468 -11.94586 -0.29118 10.66735 -9.61180 1.05555 -7.83409 6.75886 -1.07523
magnitude: 1.53464 au
magnitude: 3.90074 debye
