program: Orca
programVersion: 5.0.2
elementType: S P O O O O N C C C C C C C C C C H H H H H H H H H H H H H H H H H H H H
charge: 0
multiplicity: 1
keywords: wb97x-d3
keywords: def2-TZVPP
keywords: def2/J RIJCOSX
keywords: DEFGRID2
keywords: scfconv7
keywords: smallprint printgap noloewdin
keywords: NOSOSCF
formula: C10H20NO4PS
InChI: InChI=1/C10H20NO4PS/c1-6-11-16(17,13-5)15-9(4)7-10(12)14-8(2)3/h7-8,11H,6H2,1-5H3
37 atoms
S  -2.35686 0.035282 1.925206
P  -2.188507 -0.043374 0.019244
O  -0.678411 0.0284 -0.583136
O  3.842371 0.385656 -0.352398
O  -2.681185 -1.388766 -0.713822
O  3.206984 -1.656353 0.306338
N  -2.981317 1.145079 -0.80668
C  5.230009 0.050713 -0.202087
C  -3.18026 2.498309 -0.30895
C  0.43247 -0.667376 -0.189365
C  5.655808 0.18253 1.249582
C  5.993103 0.990763 -1.113959
C  -4.533705 3.041582 -0.72812
C  1.587096 -0.004926 -0.336585
C  2.926496 -0.54808 -0.078241
C  0.226154 -2.059675 0.290252
C  -3.954752 -1.92566 -0.377509
H  5.384242 -0.980705 -0.529981
H  -2.380491 3.160995 -0.653015
H  -3.114313 2.461804 0.777911
H  -2.964199 1.064023 -1.814642
H  6.718592 -0.043107 1.344874
H  5.113153 -0.508568 1.892085
H  5.495472 1.198455 1.613521
H  7.059211 0.768397 -1.067056
H  5.855123 2.031652 -0.818352
H  5.675463 0.884617 -2.1511
H  -5.338021 2.416194 -0.342597
H  -4.673111 4.051869 -0.343524
H  -4.632337 3.089919 -1.814055
H  1.544165 1.015195 -0.695068
H  -0.297408 -2.646474 -0.465198
H  -0.387844 -2.062539 1.193179
H  1.172722 -2.535739 0.514448
H  -4.007559 -2.178246 0.682524
H  -4.757006 -1.223167 -0.613659
H  -4.084154 -2.826805 -0.972678
totalener: -1488.51194613 hartree
nucrepener: 1561.96246681 hartree
electener: -3050.47441294 hartree
oneelecener: -5149.05137253 hartree
twoeener: 2098.57695959 hartree
kineticenergy: 1483.79313431 hartree
xcener: -107.358405920601 hartree
chargesum: -0.0000000
charge: -0.384540 0.642539 -0.301218 -0.277239 -0.329126 -0.411051 -0.262710 0.144954 -0.024681 0.224787 -0.259139 -0.228337 -0.232450 -0.270987 0.450089 -0.244208 -0.120912 0.059507 0.089258 0.088278 0.125527 0.079039 0.104913 0.082371 0.075688 0.081586 0.089965 0.084281 0.082314 0.068122 0.106970 0.103620 0.103161 0.126999 0.110452 0.105292 0.116888
qa: -0.3845 0.6425 -0.3012 -0.2772 -0.3291 -0.4111 -0.2627 0.1450 -0.0247 0.2248 -0.2591 -0.2283 -0.2325 -0.2710 0.4501 -0.2442 -0.1209 0.0595 0.0893 0.0883 0.1255 0.0790 0.1049 0.0824 0.0757 0.0816 0.0900 0.0843 0.0823 0.0681 0.1070 0.1036 0.1032 0.1270 0.1105 0.1053 0.1169
va: 2.0483 5.4875 2.1650 2.1346 2.0767 2.0857 3.1177 3.8566 3.8655 3.7589 3.9090 3.9252 3.9368 3.8963 4.1665 3.8787 3.8724 1.0244 0.9943 1.0288 1.0416 1.0090 1.0175 1.0083 1.0083 1.0096 1.0114 1.0088 1.0111 1.0044 1.0376 1.0078 1.0245 1.0405 1.0026 0.9966 0.9913
dispcorr: -0.015430398 hartree
energy: -1488.527376529259
dipole: 8.60081 -9.39434 -0.79353 6.72436 -6.14703 0.57733 -4.33008 3.09653 -1.23355
magnitude: 1.57628 au
magnitude: 4.00658 debye
