program: Orca
programVersion: 5.0.2
elementType: S P O O O O N C C C C C C C C C C H H H H H H H H H H H H H H H H H H H H
charge: 0
multiplicity: 1
keywords: wb97x-d3
keywords: def2-TZVPP
keywords: def2/J RIJCOSX
keywords: DEFGRID2
keywords: scfconv7
keywords: smallprint printgap noloewdin
keywords: NOSOSCF
formula: C10H20NO4PS
InChI: InChI=1/C10H20NO4PS/c1-6-11-16(17,13-5)15-9(4)7-10(12)14-8(2)3/h7-8,11H,6H2,1-5H3
37 atoms
S  -3.147532 -0.686718 1.437108
P  -2.161555 0.063809 -0.026036
O  -0.600358 0.452108 0.20403
O  3.881131 0.201213 -0.467242
O  -1.95535 -0.883317 -1.314312
O  3.179045 -1.614872 0.63632
N  -2.778105 1.478382 -0.589841
C  5.242445 -0.251083 -0.438578
C  -3.849483 2.241389 0.032983
C  0.466798 -0.379036 0.411959
C  5.881165 0.080783 0.89844
C  5.939038 0.434435 -1.597462
C  -5.217515 1.916504 -0.539794
C  1.634263 0.091507 -0.046553
C  2.941183 -0.559893 0.102328
C  0.214988 -1.636688 1.163896
C  -3.059381 -1.636264 -1.797034
H  5.262122 -1.333747 -0.589202
H  -3.620303 3.301471 -0.089176
H  -3.840483 2.043733 1.104096
H  -2.353422 1.881598 -1.410939
H  5.855727 1.155193 1.086913
H  6.925347 -0.233893 0.898679
H  5.38269 -0.429804 1.720462
H  5.466193 0.188538 -2.548206
H  6.97903 0.112156 -1.648785
H  5.930107 1.519017 -1.481142
H  -5.256093 2.09978 -1.614317
H  -5.463198 0.869904 -0.359586
H  -5.988161 2.527641 -0.068811
H  1.630042 1.04075 -0.566139
H  -0.433719 -2.306736 0.5971
H  -0.298539 -1.419432 2.10062
H  1.14393 -2.15394 1.370695
H  -2.702203 -2.21101 -2.648209
H  -3.437902 -2.315038 -1.031832
H  -3.874245 -0.98627 -2.1245
totalener: -1488.51032247 hartree
nucrepener: 1566.35823404 hartree
electener: -3054.86855651 hartree
oneelecener: -5157.84461061 hartree
twoeener: 2102.97605410 hartree
kineticenergy: 1483.80158721 hartree
xcener: -107.362577604387 hartree
chargesum: -0.0000000
charge: -0.391295 0.637314 -0.305262 -0.276754 -0.322106 -0.409781 -0.258858 0.144618 -0.019842 0.240057 -0.258661 -0.228419 -0.222600 -0.281424 0.447318 -0.240601 -0.127317 0.059890 0.083731 0.088006 0.127970 0.081761 0.079487 0.103491 0.090642 0.075901 0.081140 0.068362 0.079083 0.084449 0.105669 0.092723 0.107689 0.129306 0.121154 0.112776 0.100383
qa: -0.3913 0.6373 -0.3053 -0.2768 -0.3221 -0.4098 -0.2589 0.1446 -0.0198 0.2401 -0.2587 -0.2284 -0.2226 -0.2814 0.4473 -0.2406 -0.1273 0.0599 0.0837 0.0880 0.1280 0.0818 0.0795 0.1035 0.0906 0.0759 0.0811 0.0684 0.0791 0.0844 0.1057 0.0927 0.1077 0.1293 0.1212 0.1128 0.1004
va: 2.0379 5.5094 2.1876 2.1336 2.0700 2.0866 3.1004 3.8574 3.8681 3.7329 3.9100 3.9254 3.8902 3.9001 4.1700 3.9098 3.8838 1.0239 0.9996 1.0276 1.0446 1.0084 1.0091 1.0177 1.0112 1.0085 1.0097 1.0080 1.0191 1.0152 1.0389 1.0090 1.0095 1.0398 0.9919 1.0031 0.9902
dispcorr: -0.015798240 hartree
energy: -1488.526120708864
dipole: 9.24138 -9.60980 -0.36842 4.47722 -3.58193 0.89529 -6.43113 5.07901 -1.35213
magnitude: 1.66298 au
magnitude: 4.22697 debye
