program: Gaussian 09
title: 000066314
version: EM64L-G09RevD.01
frameworkgroup: C1[X(C6H10O)]
method: RPBEPBE
basis: SDD
operation: Freq
keyword: #pfreq=noraman
keyword: PBEPBE/SDD
title: #p freq=noraman PBEPBE/SDD
converged: YES YES NO NO
title: Mulliken charges:
elementType: O C C C C C C H H H H H H H H H H
charge: -0.300996 -0.010406 -0.370089 -0.418879 -0.461239 -0.021256 -0.589957 0.231978 0.218088 0.213691 0.233111 0.207359 0.206811 0.209703 0.216626 0.217570 0.217886
chargesum: 0.00000
title: Mulliken charges with hydrogens summed into heavy atoms:
elementType: O C C C C C C
charge: -0.300996 0.221572 0.061690 0.021591 -0.044725 0.195370 -0.154501
polarizability: 8.98869662e+01 -7.99730414e+00 5.14075119e+01 6.40262202e+00 -1.94804243e+00 5.65908664e+01
1716.lowfreq: -9.0760 -6.8473 -0.0008 0.0005 0.0009 15.4437 58.9761 70.2397 106.3203
frequency: 58.9075 70.2341 106.3112 154.6709 300.0470 349.0743 410.6011 450.0600 631.8421 732.1106 766.6127 798.8853 890.6888 919.9335 943.7353 973.4314 1000.6737 1019.2114 1027.9667 1037.5291 1098.6334 1117.8401 1167.2821 1204.2128 1233.8480 1251.3662 1281.7113 1290.7607 1330.3127 1394.5784 1425.5635 1461.1774 1472.9648 1482.8788 1658.9377 2960.8446 2994.5982 3021.9732 3053.0064 3058.3883 3074.1853 3078.9592 3091.6856 3163.7918 3195.6189
redmass: 3.1575 2.6382 2.6254 2.7653 2.5961 3.0302 2.3009 2.3005 1.5041 4.9059 1.7324 2.1861 1.3846 1.7129 1.3289 1.6165 1.1519 1.8702 1.4965 2.2146 1.2894 1.2948 2.1301 1.5084 1.4601 1.2401 1.1944 1.2327 1.4131 1.9664 1.1800 1.1076 1.1420 1.1618 4.7600 1.0616 1.0599 1.0968 1.0964 1.0553 1.0801 1.0915 1.0760 1.1186 1.1145
irintensity: 2.0945 0.0750 1.4491 4.6800 0.3126 5.0769 2.0444 10.2319 23.0704 2.4737 24.7794 19.0444 0.2087 0.9917 91.2086 1.8011 17.7276 3.6200 9.6347 1.2540 4.0061 7.4595 0.6732 7.4322 3.9857 0.5498 0.1320 0.4985 0.4880 13.3847 3.9386 2.3655 15.2220 7.3414 19.5297 24.8284 24.5134 7.9552 8.1804 41.7690 9.6918 62.6641 6.3109 36.7498 29.8352
temp: 298.150 k
press: 1.00000 atm
elementType: 8 6 6 6 6 6 6 1 1 1 1 1 1 1 1 1 1
symmnumber: 1
zpe: 378065.7 jmol-1
zpe.correction: 0.143998 hartree
zpe.thermalcorrener: 0.152061 hartree
zpe.thermalcorrenthalpy: 0.153006 hartree
zpe.thermalcorrgfe: 0.110797 hartree
zpe.sumelectzpe: -309.222113 hartree
zpe.sumelectthermal: -309.214049 hartree
zpe.sumelectthermalent: -309.213105 hartree
zpe.sumelectthermalfe: -309.255313 hartree
dipole: 1.4108 1.8749 0.4379
dipole: 2.3869
quadrupole: -49.9666 -45.3281 -40.0212
quadrupole: -7.1490 -1.2831 -0.9490
quadrupole: -4.8613 -0.2228 5.0841 -7.1490 -1.2831 -0.9490
hfenergy: -309.3661108 hartree
pointgroup: C01 [X(C6H10O1)]
dipole: 0.5645298 0.7391216 0.129895 debye
dipolederiv: -0.6843375 -0.1571888 0.0082633 -0.2060637 -0.4997864 -0.0663341 -0.0038477 -0.0615605 -0.3312658 0.4866218 -0.0449077 -0.0269166 0.0006443 0.1830557 0.0470498 -0.1487201 -0.0055655 0.3121641 0.1007206 0.0547482 -0.1085638 -0.064967 0.2238932 -0.0170488 -0.0873387 0.0504871 0.2355485 -0.0775767 -0.0063342 0.0407434 0.0747103 0.097249 -0.0488575 0.1240601 -0.0384296 0.0714081 -0.1141953 0.0167367 0.0389564 0.0678487 0.1398562 -0.0455202 0.0630444 -0.0345036 0.1064009 0.2625662 -0.11788 -0.0059586 -0.2247725 -0.1808154 0.0205561 -0.1396119 0.038495 0.1587247 -0.2413671 -0.0846295 -0.056995 -0.0565416 -0.3929199 0.048955 -0.064561 0.0538103 0.0812496 -0.0113839 0.0177991 -0.021273 0.0261319 0.0929408 -0.0043361 0.0040484 -0.0203176 -0.1538911 0.000911 0.0996011 0.0770512 0.1101928 -0.0532081 -0.0311113 0.0860281 -0.0647389 0.0264742 0.1032299 -0.0162499 0.0807451 0.0183796 -0.0013939 0.0544362 0.0555267 0.0906436 -0.0948042 0.0241723 0.0546519 -0.0169786 0.0377121 -0.1227794 0.0468944 0.0044116 0.0612537 0.0710973 0.0499262 -0.0139179 -0.0273704 0.0002467 0.076748 0.0225847 -0.0146294 -0.0248864 -0.1438194 0.0361452 -0.011224 -0.0325541 -0.0109279 0.0741641 0.005941 -0.0006741 -0.0367557 -0.1652657 0.0087706 0.086493 -0.0192424 0.0627259 -0.1325289 0.0442869 0.0202997 0.0677804 0.0678722 0.0429545 0.0229451 -0.0272918 0.0457139 0.1396373 -0.0216291 0.0338397 -0.0264897 -0.1481884 -0.0780881 0.0701086 0.0745643 0.094835 0.1784121 -0.0294952 0.0838796 -0.0332022 0.0310387 0.0909303 0.0292485 0.0228207 0.0241314 0.1774757 -0.0263718 -0.0157554 -0.0160207 -0.1247436 unknown
polarizability: 89.7011901|-8.1099491|51.4028241|6.7921558|-1.7223745|56.7813303 unknown
InChI: InChI=1S/C6H10O/c1-2-3-4-6-5-7-6/h2,6H,1,3-5H2
charge 0 multiplicity 1
17 atoms
O  -2.725713 -0.67522 -0.053967
C  -1.45918 -0.073144 0.518477
C  -2.454437 0.804909 -0.179065
C  -0.156321 -0.486464 -0.138649
C  1.005306 0.481059 0.228453
C  2.309535 0.09109 -0.435429
C  3.471394 -0.174691 0.212515
H  -1.456303 -0.060034 1.618748
H  -3.122867 1.448883 0.406046
H  -2.238686 1.145501 -1.200649
H  0.106651 -1.5149 0.173878
H  -0.296453 -0.511339 -1.236507
H  1.138648 0.51119 1.327337
H  0.720383 1.506436 -0.088722
H  2.283025 0.021023 -1.534908
H  4.381781 -0.453255 -0.330128
H  3.544638 -0.121744 1.306169
