program: Orca
programVersion: 5.0.2
elementType: Br Cl S P O O O C C C C C C C C C C C H H H H H H H H H H H H H H H
charge: 0
multiplicity: 1
keywords: wb97x-d3
keywords: def2-TZVPP
keywords: def2/J RIJCOSX
keywords: DEFGRID2
keywords: scfconv7
keywords: smallprint printgap noloewdin
keywords: NOSOSCF
formula: C11H15BrClO3PS
InChI: InChI=1/C11H15BrClO3PS/c1-3-7-18-17(14,15-4-2)16-11-6-5-9(12)8-10(11)13/h5-6,8H,3-4,7H2,1-2H3
33 atoms
Br 4.632147 0.152958 -0.635318
Cl 0.196984 -0.544845 2.55593
S  -2.972695 -1.297805 0.791641
P  -2.422248 0.387584 -0.253256
O  -1.186915 1.090208 0.557733
O  -3.613871 1.345388 0.150082
O  -2.110774 0.198192 -1.689509
C  -1.777944 -2.514163 0.0938
C  -2.324541 -3.266896 -1.103721
C  -3.55056 -4.10638 -0.789097
C  0.125124 0.857178 0.253732
C  -4.003852 2.474181 -0.676344
C  0.905447 0.111594 1.130679
C  0.70024 1.394557 -0.885967
C  -3.041631 3.628647 -0.566339
C  2.250317 -0.102865 0.873606
C  2.041785 1.18641 -1.158279
C  2.803925 0.433054 -0.278528
H  -1.57123 -3.192384 0.921962
H  -0.840397 -2.013605 -0.144121
H  -2.538157 -2.568323 -1.914224
H  -1.519043 -3.914593 -1.460476
H  -4.399148 -3.489347 -0.49117
H  -3.859142 -4.683803 -1.660171
H  -3.350175 -4.810157 0.02039
H  -4.111867 2.143063 -1.709456
H  -4.989069 2.750691 -0.308888
H  0.103158 1.995303 -1.558762
H  -3.459393 4.480612 -1.103111
H  -2.892493 3.928182 0.470266
H  -2.072798 3.40488 -1.012086
H  2.839901 -0.683869 1.569586
H  2.471728 1.615261 -2.05259
elementType: Br Cl S P O C H
totalener: -4428.05306059 hartree
nucrepener: 2250.94723633 hartree
electener: -6679.00029692 hartree
twoeener: 3935.26766172 hartree
cpcmener: -0.02511889 hartree
kineticenergy: 4419.42458250 hartree
xcener: -190.171002967200 hartree
chargesum: -0.0000000
charge: -0.030017 -0.065448 -0.162539 0.845831 -0.353814 -0.357589 -0.627817 -0.109100 -0.098241 -0.255715 0.250534 0.039523 -0.022441 -0.158717 -0.247601 -0.053852 -0.099703 -0.063280 0.131729 0.121516 0.064301 0.077617 0.073305 0.093348 0.085514 0.102848 0.109479 0.153344 0.100334 0.091484 0.086362 0.129082 0.149725
qa: -0.0300 -0.0654 -0.1625 0.8458 -0.3538 -0.3576 -0.6278 -0.1091 -0.0982 -0.2557 0.2505 0.0395 -0.0224 -0.1587 -0.2476 -0.0539 -0.0997 -0.0633 0.1317 0.1215 0.0643 0.0776 0.0733 0.0933 0.0855 0.1028 0.1095 0.1533 0.1003 0.0915 0.0864 0.1291 0.1497
va: 1.2221 1.2449 2.2892 5.4685 2.0773 2.1290 1.9449 3.8725 3.9275 3.9195 3.7718 3.8549 3.9951 3.9924 3.9150 3.9108 3.9039 3.9883 1.0053 1.0156 1.0269 1.0086 1.0161 1.0052 0.9997 1.0013 0.9899 0.9982 1.0089 1.0056 1.0040 1.0093 0.9943
dispcorr: -0.017700519 hartree
energy: -4428.070761104332
dipole: -69.41479 69.22984 -0.18495 -5.69567 6.08870 0.39302 -7.08844 6.92837 -0.16007
magnitude: 0.46292 au
magnitude: 1.17665 debye
