program: Gaussian 09
title: 000066330
version: EM64L-G09RevD.01
frameworkgroup: C1[X(C10H10O3)]
method: RPBEPBE
basis: SDD
operation: Freq
keyword: #pfreq=noraman
keyword: PBEPBE/SDD
title: #p freq=noraman PBEPBE/SDD
converged: YES YES NO NO
title: Mulliken charges:
elementType: O O O C C C C C C C C C C H H H H H H H H H H
charge: -0.291670 -0.387533 -0.223755 0.123306 0.186374 -0.296778 -0.391853 0.202724 -0.249386 -0.193087 -0.363920 -0.029388 -0.555039 0.279164 0.219859 0.234004 0.232032 0.219660 0.239803 0.252045 0.355960 0.220847 0.216631
chargesum: 0.00000
title: Mulliken charges with hydrogens summed into heavy atoms:
elementType: O O O C C C C C C C C C C
charge: -0.291670 -0.031573 -0.223755 0.123306 0.186374 -0.017614 -0.171995 0.202724 -0.015382 0.038945 0.095544 0.222657 -0.117561
polarizability: 1.73781850e+02 6.64543197e+00 1.24609499e+02 -3.17174069e+00 -2.89104909e+00 6.30991088e+01
1716.lowfreq: -7.8588 -0.0003 -0.0001 0.0005 4.1561 8.6811 21.5105 46.4019 51.9739
frequency: 21.2541 46.3869 51.9736 92.4423 132.5910 168.3312 232.3936 274.7683 294.2755 344.5149 381.2903 396.0780 424.6614 441.7333 500.4194 524.4465 549.0901 636.7149 664.7469 676.7389 745.4532 755.9066 766.9981 808.7242 851.7012 888.1562 932.1411 956.4925 957.4721 967.7552 989.1478 1004.6497 1021.0212 1042.3391 1096.8288 1155.6242 1160.0143 1174.9141 1225.1910 1251.0764 1253.1081 1284.0309 1296.3994 1344.6647 1395.1584 1427.1092 1429.6066 1448.3698 1490.1690 1594.6486 1607.9137 1634.1775 1659.9240 3017.6003 3089.0049 3103.7898 3112.4266 3127.5521 3143.8696 3163.8856 3186.4584 3199.1413 3552.4302
redmass: 4.4227 5.3143 5.2121 2.6441 3.8320 4.1521 4.6746 5.2547 5.4467 2.4763 5.6521 1.2518 2.6971 3.1497 2.7617 3.5028 7.5172 3.4072 2.8866 3.4991 5.5147 2.3554 1.8302 5.7550 1.4888 3.5584 1.7229 1.3691 1.3804 2.0114 1.3386 3.7636 1.4220 2.2153 2.0192 1.8864 1.2945 1.0616 3.6327 1.1993 2.6663 1.2395 1.4400 1.2356 7.0818 1.1910 2.2238 1.1378 2.5550 6.6612 6.6364 10.1155 4.6237 1.0602 1.0610 1.1021 1.0889 1.0964 1.0896 1.0954 1.0966 1.1142 1.0658
irintensity: 0.7595 3.6585 0.0577 1.6532 0.4139 2.2132 3.2513 2.3788 8.3087 4.9781 12.1351 112.6811 20.0831 2.6995 5.6254 16.8680 5.1873 17.2425 3.7777 22.8467 6.9587 57.7463 36.5059 33.5364 0.1878 25.2286 29.3847 2.5282 87.4507 4.4516 0.5238 347.3144 45.4192 4.4459 122.7386 32.9344 31.5799 9.5374 313.5117 0.9230 11.8403 6.3153 57.5072 7.6912 14.5294 5.1281 35.2212 31.0725 24.6517 26.8796 33.4140 237.8905 4.2786 33.8759 9.0693 7.3098 12.8904 6.5060 10.5045 17.1166 6.8964 23.7578 29.7949
temp: 298.150 k
press: 1.00000 atm
elementType: 8 8 8 6 6 6 6 6 6 6 6 6 6 1 1 1 1 1 1 1 1 1 1
symmnumber: 1
zpe: 461566.5 jmol-1
zpe.correction: 0.175801 hartree
zpe.thermalcorrener: 0.188200 hartree
zpe.thermalcorrenthalpy: 0.189144 hartree
zpe.thermalcorrgfe: 0.135281 hartree
zpe.sumelectzpe: -611.757397 hartree
zpe.sumelectthermal: -611.744998 hartree
zpe.sumelectthermalent: -611.744054 hartree
zpe.sumelectthermalfe: -611.797918 hartree
dipole: 2.2140 -1.6462 0.0104
dipole: 2.7590
quadrupole: -52.7530 -74.9032 -76.5583
quadrupole: 6.9617 -2.5598 -0.3333
quadrupole: 15.3185 -6.8317 -8.4868 6.9617 -2.5598 -0.3333
hfenergy: -611.9331983 hartree
pointgroup: C01 [X(C10H10O3)]
dipole: -0.8603486 0.6252715 0.2169129 debye
dipolederiv: -1.7127172 -0.1827356 -0.2394099 -0.2589671 -0.4487228 -0.1577454 -0.504934 -0.09222 -0.5281839 -0.0263098 -0.0360857 0.0366546 -0.249901 -1.1636484 -0.3427451 -0.0469719 -0.3170114 -0.5088551 -0.7706457 0.2292438 0.0733324 0.1077278 -0.7149219 -0.2526475 -0.0978668 -0.240113 -0.4761691 -0.6805038 0.0108141 -0.0704256 0.3510384 -0.2767252 -0.0567836 0.0405558 -0.1107392 -0.0916217 0.1903165 -0.0989318 -0.0331901 0.309994 1.0715029 0.4156267 0.1738272 0.3590036 0.2584839 0.1819499 -0.0007572 0.0463493 -0.3184661 0.0935357 0.0279856 -0.1362513 0.0947212 -0.0679222 0.0051506 0.3087251 0.1631751 -0.029579 -0.3516299 -0.0611425 0.0220552 -0.0033676 -0.204835 2.1633652 -0.1799151 0.228366 0.0495575 0.8872497 0.4517778 0.610327 0.423458 0.639557 -0.467354 -0.0118651 -0.0396796 -0.0106375 0.0139278 0.0902911 -0.050118 0.0890922 -0.166492 0.2037099 -0.0256439 0.0436038 0.1591815 0.1413708 0.1267789 0.1194673 0.0984727 -0.0498684 1.0007644 0.0526795 0.0342971 -0.2224531 0.2545377 -0.0412192 -0.0192522 -0.0804287 0.2837486 -0.1239803 0.1411065 -0.0081591 0.1921131 -0.1277089 0.0574241 -0.0867238 0.0031577 0.0664125 -0.2637747 0.1325832 0.0035461 0.1356622 -0.2629489 0.0158786 0.0714293 0.0284237 0.1303116 0.0654407 -0.0600807 -0.0384708 -0.0847513 0.0952359 -0.0296417 -0.0379062 -0.0394941 0.1277671 -0.0378874 -0.0626846 -0.0588837 -0.1032885 0.0094045 -0.0842893 -0.0779084 -0.0754076 0.1291227 0.0721396 0.0150492 -0.008835 0.0365979 -0.0702473 -0.097638 0.0049646 -0.0983534 0.1287896 -0.078793 0.0909114 0.0002839 0.0885778 0.0621546 -0.0239876 -0.0029485 -0.0243337 0.1442067 -0.044228 -0.0110612 -0.0703032 -0.0347238 0.0931187 -0.0802522 -0.0480451 -0.0112851 -0.0787783 -0.0165786 -0.0755222 0.0191554 0.0827671 -0.0654145 0.0460579 0.0952482 -0.0075364 0.0882769 0.1305623 -0.0574909 -0.0615043 -0.0807141 0.0981745 -0.0362586 -0.0215388 -0.0041195 -0.0618172 0.041118 -0.0338275 -0.0660071 0.0650501 0.3981601 0.0175305 -0.0256195 0.0068784 0.3736254 0.0586038 -0.0863275 0.076637 -0.1243281 0.1244455 0.0416557 0.0922648 0.0534326 -0.0391916 0.1096517 -0.0581837 -0.0305322 -0.0604578 0.1391493 -0.026656 -0.0740549 -0.0522305 -0.0965675 unknown
polarizability: 173.7141836|3.1429392|114.6649404|7.9635511|22.558702|73.1113329 unknown
InChI: InChI=1S/C10H10O3/c1-2-7-13-10(12)8-5-3-4-6-9(8)11/h2-6,11H,1,7H2
charge 0 multiplicity 1
23 atoms
O  1.50819 0.066184 0.705095
O  -1.848765 -1.944385 -0.991307
O  0.899216 -1.652969 -0.750917
C  -0.767688 0.003872 -0.009353
C  -1.947085 -0.6484 -0.482848
C  -0.896393 1.314354 0.530261
C  -3.201563 0.011645 -0.414874
C  0.574915 -0.63955 -0.089931
C  -2.139925 1.969802 0.594703
C  -3.298123 1.31167 0.116729
C  2.910635 -0.462981 0.676841
C  3.683692 0.112353 -0.482504
C  4.770743 0.910368 -0.340853
H  0.010087 1.804578 0.893425
H  -4.101521 -0.500909 -0.779999
H  -2.20832 2.980141 1.009283
H  -4.27402 1.807534 0.158282
H  3.331592 -0.154594 1.646699
H  2.85554 -1.565024 0.606151
H  3.325363 -0.170646 -1.481139
H  -2.742292 -2.27493 -1.265119
H  5.322283 1.288545 -1.208644
H  5.145236 1.203742 0.648221
