program: Gaussian 09
title: 000066343
version: EM64L-G09RevD.01
frameworkgroup: C1[X(C11H14O4)]
method: RPBEPBE
basis: SDD
operation: Freq
keyword: #pfreq=noraman
keyword: PBEPBE/SDD
title: #p freq=noraman PBEPBE/SDD
converged: YES YES NO NO
title: Mulliken charges:
elementType: O O O O C C C C C C C C C C C H H H H H H H H H H H H H H
charge: -0.287940 -0.270265 -0.417755 -0.243683 -0.554215 0.404903 -0.450347 0.184277 -0.545726 0.329820 -0.325421 -0.374741 0.220201 -0.538596 -0.536385 0.260099 0.212235 0.230101 0.237240 0.243630 0.239552 0.248208 0.219260 0.230427 0.234733 0.218357 0.243978 0.217404 0.370650
chargesum: 0.00000
title: Mulliken charges with hydrogens summed into heavy atoms:
elementType: O O O O C C C C C C C C C C C
charge: -0.287940 -0.270265 -0.047106 -0.243683 -0.081882 0.404903 0.016994 0.184277 -0.302096 0.329820 -0.085869 -0.126533 0.220201 0.145823 0.143354
polarizability: 1.72891737e+02 -1.48428867e+01 1.34950680e+02 1.15523712e+01 1.23693122e+01 8.98260681e+01
1716.lowfreq: -5.1335 -0.0008 -0.0004 0.0004 9.3307 13.5054 19.3178 46.7606 61.5036
frequency: 19.1491 46.7581 61.4493 67.4774 102.4986 116.0420 143.9342 160.7916 184.5956 227.8552 242.5842 257.5523 302.7250 328.3396 380.9553 404.4752 426.8486 443.8684 463.8757 509.1374 522.8146 570.6471 585.9084 618.2730 669.4858 692.6004 721.0035 737.6459 782.2899 806.9851 860.7671 874.4963 928.6217 939.8536 942.0495 990.4440 1005.3056 1008.5971 1074.7077 1107.8573 1112.8496 1113.9096 1146.5293 1157.8962 1174.4694 1182.0538 1197.5368 1213.8141 1256.1062 1287.1872 1291.8795 1309.1241 1347.4789 1384.7401 1418.9663 1437.5297 1443.1629 1446.7762 1466.0708 1467.6672 1468.3874 1472.6536 1475.0074 1498.0447 1597.9989 1621.4960 1668.3463 2951.1614 2957.8642 3005.6527 3021.3983 3035.4243 3045.9552 3076.1483 3099.6358 3118.4936 3120.7385 3140.8171 3153.3096 3174.4156 3520.4539
redmass: 5.8153 5.5243 3.5199 5.3546 4.2703 3.6762 4.9919 3.3856 3.3768 1.3415 1.7687 1.4101 2.9921 2.8302 4.8231 2.5779 4.3016 3.9672 3.3752 3.9042 4.0883 1.9736 2.1605 2.7271 4.8121 3.7684 4.6043 3.1687 3.6461 1.5085 1.5603 3.3516 1.3624 2.2610 2.9831 7.7903 4.3738 3.3849 1.7453 2.0262 1.2603 1.2650 1.4502 1.3834 1.4042 1.2096 1.8807 1.5900 2.7350 1.6875 1.8064 1.2657 1.6280 6.9671 2.2708 1.2156 1.3756 1.1503 1.0506 1.0627 1.1430 1.1139 1.0518 2.1863 8.0285 6.6360 8.3495 1.0335 1.0329 1.0618 1.0601 1.1036 1.1037 1.1011 1.1024 1.0994 1.0985 1.0904 1.0872 1.0966 1.0639
irintensity: 0.4978 3.5061 6.4884 0.4117 0.1062 0.9210 1.7468 7.0772 5.1964 0.2242 1.0173 0.6350 0.0821 1.1631 0.2892 3.9474 2.6122 6.2485 2.2910 3.8614 43.1396 54.2985 67.9317 20.3729 38.7322 30.4481 4.4991 1.8132 1.5327 49.2509 19.8426 11.3079 0.4084 60.9671 28.1155 14.7241 158.3209 12.6665 118.4978 12.7203 0.1978 0.3041 3.2254 0.8214 14.7447 12.4575 262.8850 69.3120 1.8937 14.1556 38.3954 3.2156 17.2103 26.9405 34.7092 3.7366 5.1479 19.9041 14.2939 15.9840 40.9826 119.7639 1.5995 133.8826 1.8667 11.8355 203.0192 75.7388 62.2952 25.2564 26.3712 53.7352 43.1585 5.9050 14.5676 26.4845 27.5725 12.0784 7.3612 8.2591 18.4214
temp: 298.150 k
press: 1.00000 atm
elementType: 8 8 8 8 6 6 6 6 6 6 6 6 6 6 6 1 1 1 1 1 1 1 1 1 1 1 1 1 1
symmnumber: 1
zpe: 606569.0 jmol-1
zpe.correction: 0.231030 hartree
zpe.thermalcorrener: 0.246484 hartree
zpe.thermalcorrenthalpy: 0.247428 hartree
zpe.thermalcorrgfe: 0.186953 hartree
zpe.sumelectzpe: -727.306829 hartree
zpe.sumelectthermal: -727.291374 hartree
zpe.sumelectthermalent: -727.290430 hartree
zpe.sumelectthermalfe: -727.350905 hartree
dipole: -0.0443 -0.2923 -1.5431
dipole: 1.5712
quadrupole: -80.5518 -72.2814 -97.1970
quadrupole: -13.0624 0.9876 2.7181
quadrupole: 2.7916 11.0620 -13.8536 -13.0624 0.9876 2.7181
hfenergy: -727.5378585 hartree
pointgroup: C01 [X(C11H14O4)]
dipole: 0.0269478 -0.0796827 0.6123953 debye
polarizability: 171.094018|17.5853249|135.3991153|10.947937|-14.2875463|91.1753514 unknown
InChI: InChI=1S/C11H14O4/c1-14-9-4-5-10(15-2)8(7-9)3-6-11(12)13/h4-5,7,12H,3,6H2,1-2H3
charge 0 multiplicity 1
29 atoms
O  1.473674 1.466295 0.53494
O  -3.806082 -0.319319 -0.332674
O  3.856723 -0.782477 0.250915
O  2.650682 -0.582932 -1.723739
C  0.913264 -1.192616 1.239869
C  -0.156874 -0.281711 0.661801
C  1.753266 -1.942638 0.149382
C  0.146627 1.055971 0.290205
C  -1.47421 -0.759451 0.462555
C  -2.472702 0.071492 -0.101752
C  -0.84958 1.889512 -0.274817
C  -2.15411 1.397735 -0.471267
C  2.741309 -1.04477 -0.565562
C  1.857229 2.804083 0.086598
C  -4.174722 -1.688655 0.022357
H  1.606928 -0.621102 1.87996
H  0.432629 -1.965706 1.867697
H  2.322197 -2.750183 0.644469
H  1.082459 -2.383924 -0.605939
H  -1.702066 -1.789006 0.759333
H  -0.622465 2.918215 -0.568862
H  -2.935759 2.026295 -0.908101
H  1.269505 3.588021 0.603887
H  1.736534 2.908797 -1.00904
H  2.919309 2.906685 0.355492
H  -3.582954 -2.429602 -0.551316
H  -5.238219 -1.780407 -0.24368
H  -4.046264 -1.87525 1.10734
H  4.461171 -0.153448 -0.22785
