program: Orca
programVersion: 5.0.2
elementType: Br Cl S P O O O C C C C C C C C C C C H H H H H H H H H H H H H H H
charge: 0
multiplicity: 1
keywords: wb97x-d3
keywords: def2-TZVPP
keywords: def2/J RIJCOSX
keywords: DEFGRID2
keywords: scfconv7
keywords: smallprint printgap noloewdin
keywords: NOSOSCF
formula: C11H15BrClO3PS
InChI: InChI=1/C11H15BrClO3PS/c1-3-7-18-17(14,15-4-2)16-11-6-5-9(12)8-10(11)13/h5-6,8H,3-4,7H2,1-2H3
33 atoms
Br 4.444656 -0.830346 -0.393576
Cl 0.143698 0.405689 2.816977
S  -2.655327 -0.939988 0.998339
P  -2.379372 0.68627 -0.237728
O  -1.068538 1.445804 0.37129
O  -3.497996 1.705361 0.229979
O  -2.273975 0.388998 -1.685778
C  -2.963105 -2.304158 -0.198592
C  -1.775267 -3.238128 -0.346248
C  -0.534126 -2.603892 -0.951076
C  0.184075 0.929957 0.173761
C  -3.668899 2.988862 -0.431028
C  0.871311 0.397386 1.258307
C  0.783905 0.957336 -1.074596
C  -4.619565 2.882687 -1.596888
C  2.145535 -0.124687 1.098802
C  2.054034 0.434812 -1.250437
C  2.718803 -0.111063 -0.16296
H  -3.267749 -1.879532 -1.153832
H  -3.822714 -2.835669 0.208984
H  -1.535241 -3.68068 0.623899
H  -2.113077 -4.062996 -0.980513
H  -0.113961 -1.835706 -0.300558
H  0.241709 -3.355018 -1.101021
H  -0.74627 -2.147902 -1.919525
H  -4.064106 3.648349 0.339234
H  -2.701723 3.388565 -0.741728
H  0.26433 1.397361 -1.914503
H  -4.788862 3.879702 -2.005244
H  -4.218216 2.259989 -2.395712
H  -5.58455 2.479298 -1.289818
H  2.664645 -0.536652 1.953494
H  2.505408 0.460263 -2.232635
elementType: Br Cl S P O C H
totalener: -4428.05365420 hartree
nucrepener: 2286.71951718 hartree
electener: -6714.77317138 hartree
twoeener: 3971.46510919 hartree
cpcmener: -0.02286904 hartree
kineticenergy: 4419.41585887 hartree
xcener: -190.169660464719 hartree
chargesum: 0.0000000
charge: -0.028500 -0.061181 -0.172423 0.861483 -0.355154 -0.361381 -0.626930 -0.087534 -0.081346 -0.246631 0.242860 0.041003 -0.007076 -0.183120 -0.246993 -0.057257 -0.086453 -0.064778 0.111929 0.131154 0.069576 0.077141 0.035937 0.101244 0.086175 0.109541 0.101137 0.150458 0.098324 0.080458 0.088861 0.129534 0.149942
qa: -0.0285 -0.0612 -0.1724 0.8615 -0.3552 -0.3614 -0.6269 -0.0875 -0.0813 -0.2466 0.2429 0.0410 -0.0071 -0.1831 -0.2470 -0.0573 -0.0865 -0.0648 0.1119 0.1312 0.0696 0.0771 0.0359 0.1012 0.0862 0.1095 0.1011 0.1505 0.0983 0.0805 0.0889 0.1295 0.1499
va: 1.2223 1.2494 2.3016 5.4460 2.0971 2.1302 1.9487 3.8591 3.8926 3.9279 3.7910 3.8749 3.9737 3.9808 3.9190 3.9029 3.8645 3.9810 1.0331 1.0082 1.0106 1.0095 1.0162 1.0097 1.0081 0.9910 0.9978 1.0128 1.0069 1.0201 1.0040 1.0101 0.9935
dispcorr: -0.018829310 hartree
energy: -4428.072483508367
dipole: -65.00013 64.44582 -0.55431 4.01654 -3.86587 0.15067 -12.21408 11.88354 -0.33053
magnitude: 0.66274 au
magnitude: 1.68454 debye
