program: Orca
programVersion: 5.0.2
elementType: Br Cl S P O O O C C C C C C C C C C C H H H H H H H H H H H H H H H
charge: 0
multiplicity: 1
keywords: wb97x-d3
keywords: def2-TZVPP
keywords: def2/J RIJCOSX
keywords: DEFGRID2
keywords: scfconv7
keywords: smallprint printgap noloewdin
keywords: NOSOSCF
formula: C11H15BrClO3PS
InChI: InChI=1/C11H15BrClO3PS/c1-3-7-18-17(14,15-4-2)16-11-6-5-9(12)8-10(11)13/h5-6,8H,3-4,7H2,1-2H3
33 atoms
Br 4.570218 -0.407371 -0.423683
Cl 0.194237 1.034958 2.597334
S  -2.312339 -1.088658 1.192674
P  -2.445468 0.343189 -0.281844
O  -1.173747 1.302111 0.053733
O  -3.624463 1.307204 0.158486
O  -2.505252 -0.162533 -1.673823
C  -3.245619 -2.462347 0.404086
C  -2.384127 -3.356888 -0.465485
C  -3.203412 -4.510893 -1.025747
C  0.120161 0.87772 -0.08724
C  -4.352186 2.109925 -0.808536
C  0.896618 0.732913 1.056284
C  0.677503 0.641849 -1.332518
C  -3.513742 3.213635 -1.402021
C  2.227122 0.358087 0.964738
C  2.004879 0.258721 -1.439537
C  2.766384 0.116906 -0.289485
H  -4.095857 -2.054427 -0.142499
H  -3.652186 -3.018071 1.25018
H  -1.9519 -2.777685 -1.282032
H  -1.550086 -3.743076 0.123929
H  -2.589172 -5.156883 -1.653237
H  -3.62146 -5.12613 -0.227362
H  -4.033295 -4.149954 -1.635507
H  -4.756897 1.456178 -1.582304
H  -5.187988 2.516502 -0.242466
H  0.084784 0.772813 -2.227532
H  -3.085159 3.853523 -0.63063
H  -2.709626 2.832061 -2.032745
H  -4.153863 3.833328 -2.030695
H  2.817189 0.25837 1.865547
H  2.4236 0.079942 -2.420253
elementType: Br Cl S P O C H
totalener: -4428.05512684 hartree
nucrepener: 2236.10765590 hartree
electener: -6664.16278274 hartree
twoeener: 3920.89839035 hartree
cpcmener: -0.02390803 hartree
kineticenergy: 4419.41725761 hartree
xcener: -190.167906596508 hartree
chargesum: -0.0000000
charge: -0.028319 -0.061355 -0.177185 0.852095 -0.354114 -0.359774 -0.628217 -0.072577 -0.094238 -0.271018 0.248514 0.036380 -0.038279 -0.180718 -0.246968 -0.041068 -0.079804 -0.075770 0.117697 0.130040 0.065011 0.066269 0.093473 0.084965 0.085201 0.102527 0.111672 0.154869 0.091455 0.086154 0.099946 0.131570 0.151566
qa: -0.0283 -0.0614 -0.1772 0.8521 -0.3541 -0.3598 -0.6282 -0.0726 -0.0942 -0.2710 0.2485 0.0364 -0.0383 -0.1807 -0.2470 -0.0411 -0.0798 -0.0758 0.1177 0.1300 0.0650 0.0663 0.0935 0.0850 0.0852 0.1025 0.1117 0.1549 0.0915 0.0862 0.0999 0.1316 0.1516
va: 1.2230 1.2509 2.3206 5.4428 2.1004 2.1104 1.9436 3.8488 3.9039 3.9560 3.7771 3.8539 4.0205 4.0210 3.9008 3.8889 3.8737 3.9928 1.0203 1.0046 1.0262 1.0126 1.0037 1.0006 1.0010 1.0021 0.9907 1.0085 1.0060 1.0140 1.0082 1.0074 0.9928
dispcorr: -0.016325913 hartree
energy: -4428.071452754005
dipole: -74.19682 73.21057 -0.98625 -7.51644 7.45178 -0.06466 -11.41650 11.10583 -0.31067
magnitude: 1.03604 au
magnitude: 2.63341 debye
