program: Orca
programVersion: 5.0.2
elementType: Br Cl S P O O O C C C C C C C C C C C H H H H H H H H H H H H H H H
charge: 0
multiplicity: 1
keywords: wb97x-d3
keywords: def2-TZVPP
keywords: def2/J RIJCOSX
keywords: DEFGRID2
keywords: scfconv7
keywords: smallprint printgap noloewdin
keywords: NOSOSCF
formula: C11H15BrClO3PS
InChI: InChI=1/C11H15BrClO3PS/c1-3-7-18-17(14,15-4-2)16-11-6-5-9(12)8-10(11)13/h5-6,8H,3-4,7H2,1-2H3
33 atoms
Br 4.687893 -0.118986 -0.481681
Cl 0.263076 0.651212 2.704906
S  -2.252548 -1.186278 1.125829
P  -2.320457 0.316377 -0.278723
O  -1.118323 1.295479 0.220672
O  -3.585098 1.193369 0.103612
O  -2.227126 -0.104637 -1.697098
C  -3.342978 -2.429637 0.322933
C  -2.603827 -3.370611 -0.608965
C  -3.555003 -4.408703 -1.187281
C  0.197251 0.956225 0.030415
C  -4.264008 2.014461 -0.883475
C  0.973543 0.636816 1.138241
C  0.771764 0.968614 -1.229924
C  -3.466521 3.234992 -1.264769
C  2.315341 0.320821 0.994861
C  2.111195 0.652473 -1.389376
C  2.868823 0.323529 -0.275666
H  -4.163279 -1.9158 -0.178726
H  -3.778489 -2.974457 1.161376
H  -2.135809 -2.805133 -1.415508
H  -1.79971 -3.866591 -0.061822
H  -4.020506 -5.004885 -0.400948
H  -4.35264 -3.939413 -1.764782
H  -3.026475 -5.092917 -1.851012
H  -4.502261 1.405291 -1.755491
H  -5.199353 2.293034 -0.40314
H  0.181468 1.243805 -2.092858
H  -2.553072 2.981358 -1.803146
H  -4.073562 3.854067 -1.925619
H  -3.206919 3.832892 -0.391903
H  2.902839 0.074044 1.868704
H  2.54253 0.667494 -2.380637
elementType: Br Cl S P O C H
totalener: -4428.05518129 hartree
nucrepener: 2230.87506502 hartree
electener: -6658.93024631 hartree
twoeener: 3915.69665298 hartree
cpcmener: -0.02459035 hartree
kineticenergy: 4419.41793352 hartree
xcener: -190.167911307170 hartree
chargesum: -0.0000000
charge: -0.027901 -0.061064 -0.180535 0.853895 -0.361198 -0.358438 -0.628349 -0.073325 -0.091809 -0.273076 0.256895 0.041384 -0.040804 -0.179355 -0.244677 -0.043821 -0.081807 -0.076877 0.116618 0.131542 0.065318 0.064470 0.084953 0.085722 0.093955 0.100703 0.111872 0.156870 0.085329 0.099512 0.090759 0.132088 0.151152
qa: -0.0279 -0.0611 -0.1805 0.8539 -0.3612 -0.3584 -0.6283 -0.0733 -0.0918 -0.2731 0.2569 0.0414 -0.0408 -0.1794 -0.2447 -0.0438 -0.0818 -0.0769 0.1166 0.1315 0.0653 0.0645 0.0850 0.0857 0.0940 0.1007 0.1119 0.1569 0.0853 0.0995 0.0908 0.1321 0.1512
va: 1.2237 1.2505 2.3241 5.4547 2.1022 2.1055 1.9444 3.8599 3.9057 3.9556 3.7705 3.8459 4.0326 4.0227 3.9109 3.8936 3.8742 3.9974 1.0181 1.0029 1.0270 1.0132 1.0004 1.0008 1.0037 1.0047 0.9911 1.0056 1.0110 1.0086 1.0058 1.0074 0.9932
dispcorr: -0.016197328 hartree
energy: -4428.071378615223
dipole: -76.69899 75.50124 -1.19774 -8.66438 8.73633 0.07195 -11.50956 11.18401 -0.32555
magnitude: 1.24328 au
magnitude: 3.16017 debye
