program: Orca
programVersion: 5.0.2
elementType: Br Cl S P O O O C C C C C C C C C C C H H H H H H H H H H H H H H H
charge: 0
multiplicity: 1
keywords: wb97x-d3
keywords: def2-TZVPP
keywords: def2/J RIJCOSX
keywords: DEFGRID2
keywords: scfconv7
keywords: smallprint printgap noloewdin
keywords: NOSOSCF
formula: C11H15BrClO3PS
InChI: InChI=1/C11H15BrClO3PS/c1-3-7-18-17(14,15-4-2)16-11-6-5-9(12)8-10(11)13/h5-6,8H,3-4,7H2,1-2H3
33 atoms
Br 4.37592 -0.623095 1.112212
Cl 0.714112 0.438096 -2.855163
S  -2.517708 -1.174111 0.603736
P  -2.561748 0.727289 -0.193247
O  -1.079525 1.121402 -0.714493
O  -2.673906 1.656362 1.090164
O  -3.530497 0.936601 -1.291589
C  -2.984463 -2.186379 -0.853999
C  -1.922092 -2.262917 -1.93364
C  -0.599958 -2.84581 -1.466042
C  0.127357 0.705146 -0.237981
C  -3.928714 1.807317 1.804176
C  1.09558 0.364833 -1.178571
C  0.439362 0.640505 1.110519
C  -4.69687 3.001447 1.301051
C  2.362824 -0.030261 -0.785912
C  1.70145 0.237714 1.518094
C  2.654191 -0.090926 0.567566
H  -3.930936 -1.809704 -1.238505
H  -3.175476 -3.171163 -0.424068
H  -2.337312 -2.887993 -2.728726
H  -1.768741 -1.277919 -2.379343
H  0.109562 -2.903945 -2.291308
H  -0.141107 -2.241912 -0.68221
H  -0.733444 -3.854774 -1.07138
H  -4.520838 0.892726 1.72637
H  -3.647153 1.928928 2.848154
H  -0.285365 0.917235 1.864119
H  -5.024974 2.869689 0.270658
H  -5.584167 3.13449 1.920232
H  -4.104583 3.913667 1.368069
H  3.097922 -0.287582 -1.536372
H  1.92105 0.195137 2.575686
elementType: Br Cl S P O C H
totalener: -4428.05576933 hartree
nucrepener: 2277.13009350 hartree
electener: -6705.18586283 hartree
twoeener: 3961.14627020 hartree
cpcmener: -0.02717447 hartree
kineticenergy: 4419.41122777 hartree
xcener: -190.173396953313 hartree
chargesum: -0.0000000
charge: -0.028638 -0.067092 -0.176997 0.815496 -0.330879 -0.343163 -0.630178 -0.086051 -0.104730 -0.266982 0.215106 0.054526 0.000626 -0.161202 -0.243877 -0.048667 -0.105053 -0.065178 0.128701 0.129468 0.089758 0.054540 0.095631 0.064303 0.103415 0.090910 0.108830 0.161990 0.079681 0.097683 0.089399 0.128399 0.150224
qa: -0.0286 -0.0671 -0.1770 0.8155 -0.3309 -0.3432 -0.6302 -0.0861 -0.1047 -0.2670 0.2151 0.0545 0.0006 -0.1612 -0.2439 -0.0487 -0.1051 -0.0652 0.1287 0.1295 0.0898 0.0545 0.0956 0.0643 0.1034 0.0909 0.1088 0.1620 0.0797 0.0977 0.0894 0.1284 0.1502
va: 1.2241 1.2438 2.2865 5.4869 2.1197 2.1131 1.9794 3.8604 3.8612 3.9256 3.7986 3.8449 3.9281 3.9489 3.9426 3.8880 3.9253 3.9970 1.0223 1.0035 1.0112 1.0346 1.0064 1.0063 1.0057 1.0046 0.9913 1.0069 1.0183 1.0069 1.0044 1.0105 0.9945
dispcorr: -0.019160861 hartree
energy: -4428.074930187830
dipole: -67.59043 67.20497 -0.38546 0.35379 -1.30367 -0.94988 -6.04036 7.86108 1.82072
magnitude: 2.08947 au
magnitude: 5.31101 debye
