program: Orca
programVersion: 5.0.2
elementType: Br Cl S P O O O C C C C C C C C C C C H H H H H H H H H H H H H H H
charge: 0
multiplicity: 1
keywords: wb97x-d3
keywords: def2-TZVPP
keywords: def2/J RIJCOSX
keywords: DEFGRID2
keywords: scfconv7
keywords: smallprint printgap noloewdin
keywords: NOSOSCF
formula: C11H15BrClO3PS
InChI: InChI=1/C11H15BrClO3PS/c1-3-7-18-17(14,15-4-2)16-11-6-5-9(12)8-10(11)13/h5-6,8H,3-4,7H2,1-2H3
33 atoms
Br 4.736114 1.771609 0.282938
Cl 0.385787 -1.172868 1.938647
S  -3.260951 -1.622329 -1.237216
P  -1.875332 -0.125829 -1.038194
O  -0.49707 -0.967286 -0.856791
O  -1.987419 0.549668 0.397386
O  -1.919973 0.804099 -2.188597
C  -2.986907 -2.648228 0.264187
C  -4.277708 -3.366358 0.624103
C  -5.376639 -2.439135 1.115894
C  0.681552 -0.311545 -0.598718
C  -2.776738 1.743273 0.612748
C  1.216452 -0.340389 0.683178
C  1.361368 0.337214 -1.615058
C  -4.259698 1.496474 0.484715
C  2.427604 0.276908 0.954367
C  2.573254 0.957296 -1.360284
C  3.091856 0.926026 -0.075095
H  -2.666438 -2.008942 1.086057
H  -2.19058 -3.355347 0.040667
H  -4.628058 -3.958265 -0.225311
H  -4.023816 -4.084653 1.407124
H  -5.703541 -1.744799 0.341256
H  -6.249811 -3.009726 1.432211
H  -5.037944 -1.849948 1.969951
H  -2.522716 2.058261 1.622826
H  -2.44478 2.522731 -0.074124
H  0.954612 0.340764 -2.61732
H  -4.590637 0.685853 1.134013
H  -4.789421 2.401775 0.782255
H  -4.555307 1.267143 -0.539295
H  2.83039 0.245007 1.957712
H  3.094446 1.453972 -2.166727
elementType: Br Cl S P O C H
totalener: -4428.05463163 hartree
nucrepener: 2237.34345803 hartree
electener: -6665.39808967 hartree
twoeener: 3921.45262828 hartree
cpcmener: -0.02539408 hartree
kineticenergy: 4419.42877724 hartree
xcener: -190.171533632166 hartree
chargesum: -0.0000000
charge: -0.028165 -0.063676 -0.162580 0.818671 -0.353298 -0.329017 -0.631707 -0.091124 -0.090589 -0.276018 0.251217 0.047622 -0.017350 -0.181681 -0.262526 -0.053287 -0.087349 -0.071319 0.098758 0.128203 0.074707 0.080307 0.078633 0.102168 0.085360 0.104873 0.101644 0.158314 0.092770 0.106858 0.086854 0.131521 0.151206
qa: -0.0282 -0.0637 -0.1626 0.8187 -0.3533 -0.3290 -0.6317 -0.0911 -0.0906 -0.2760 0.2512 0.0476 -0.0174 -0.1817 -0.2625 -0.0533 -0.0873 -0.0713 0.0988 0.1282 0.0747 0.0803 0.0786 0.1022 0.0854 0.1049 0.1016 0.1583 0.0928 0.1069 0.0869 0.1315 0.1512
va: 1.2233 1.2457 2.2986 5.4744 2.1049 2.0860 1.9800 3.9034 3.8959 3.9400 3.7663 3.8389 4.0305 4.0462 3.9206 3.8911 3.8828 3.9930 1.0240 1.0098 1.0109 1.0068 1.0045 1.0071 0.9973 0.9912 1.0056 1.0042 0.9993 1.0126 1.0102 1.0076 0.9926
dispcorr: -0.017743943 hartree
energy: -4428.072375576032
dipole: -82.79326 82.04372 -0.74954 -23.19224 22.63769 -0.55455 1.49057 0.19233 1.68290
magnitude: 1.92393 au
magnitude: 4.89024 debye
