program: Gaussian 09
title: 000066315
version: EM64L-G09RevD.01
frameworkgroup: C1[X(C8H19NO3)]
method: RPBEPBE
basis: SDD
operation: Freq
keyword: #p
keyword: freq=noraman
keyword: PBEPBE/SDD
title: #p freq=noraman PBEPBE/SDD
converged: YES YES NO NO
title: Mulliken charges:
elementType: O O O N C C C C C C C C H H H H H H H H H H H H H H H H H H H
charge: -0.456984 -0.449043 -0.455696 -0.130379 -0.380707 -0.401607 -0.355461 -0.041108 -0.023523 -0.322137 -0.705197 -0.685590 0.230625 0.211528 0.189021 0.222564 0.220848 0.222189 0.191735 0.186236 0.193895 0.197270 0.235836 0.220275 0.206566 0.217447 0.216896 0.229573 0.339314 0.328907 0.346709
chargesum: 0.00000
title: Mulliken charges with hydrogens summed into heavy atoms:
elementType: O O O N C C C C C C C C
charge: -0.117671 -0.120136 -0.108986 -0.130379 0.061447 0.009979 0.087575 0.150627 0.162713 0.069027 -0.042520 -0.021674
polarizability: 1.12438868e+02 -8.54317824e-01 1.09706278e+02 4.31647270e+00 -6.46829353e-01 9.76242951e+01
1716.lowfreq: -15.2071 -6.9084 0.0007 0.0008 0.0008 10.7281 32.1859 41.1665 50.0500
frequency: 31.6384 40.8212 50.0284 56.9029 64.2556 81.6662 176.2266 179.7472 205.9319 212.1525 235.2069 257.4665 282.7891 292.0216 311.3835 318.9942 326.9255 358.4840 397.5862 425.2933 429.2521 452.9988 529.3104 536.5348 811.8320 821.8233 832.3417 849.5985 896.6047 897.6358 924.1538 931.2255 975.9173 1010.0190 1042.1250 1057.2684 1062.3148 1073.1561 1076.0983 1091.4269 1112.4851 1158.8827 1181.0463 1205.5367 1213.7904 1235.9502 1247.1716 1267.2301 1277.9319 1291.6744 1304.7994 1317.7611 1346.6140 1347.9328 1365.6577 1370.9628 1376.2575 1390.9465 1398.3957 1412.6618 1458.6755 1461.2774 1464.0277 1467.2248 1474.6575 1475.9339 1476.6492 1485.5905 2838.8409 2919.4024 2925.5635 2941.8589 2945.1818 2946.6130 2973.6039 2992.0262 2999.6469 3036.7799 3043.8315 3054.3984 3067.2106 3085.5532 3092.1167 3103.9636 3540.3548 3566.1510 3578.2894
redmass: 2.9045 3.6777 3.1755 4.3496 3.8797 2.7015 1.8531 2.6559 1.2957 3.2286 1.1497 1.0784 1.0769 3.4080 1.2999 3.3948 2.5920 2.7129 2.2389 2.3818 2.9891 2.0861 3.8453 3.6110 1.1689 2.5467 2.6631 3.7948 1.9161 1.7049 1.6387 1.8261 6.6696 2.2053 1.8696 2.0270 2.0450 2.1690 1.7123 1.8790 1.7338 1.5102 1.8962 1.3213 1.2986 1.2963 1.4259 1.3285 1.2518 1.2402 1.2630 1.3164 1.3727 1.3424 1.3367 1.2655 1.3201 1.5763 1.5374 1.4663 1.0846 1.0498 1.0627 1.0668 1.0719 1.0777 1.0592 1.0827 1.0711 1.0686 1.0687 1.0836 1.0578 1.0814 1.0360 1.0357 1.1046 1.0888 1.0926 1.0948 1.0991 1.0988 1.0993 1.0998 1.0657 1.0662 1.0666
irintensity: 0.8654 0.0427 1.5279 1.1682 4.1649 9.2362 1.3098 1.6035 8.4839 8.8124 2.3768 132.7014 141.3696 29.6249 91.2006 12.7932 63.5812 3.8362 3.7806 0.1597 22.2398 5.6808 5.9222 10.9142 4.6701 5.3383 3.6956 23.3796 22.6213 16.1838 11.8514 13.2387 102.1313 37.0220 83.8299 88.7010 32.5282 66.3806 8.1643 9.2725 11.6625 2.3874 13.4197 34.7398 15.8628 44.1139 19.7256 7.1059 11.1804 5.9403 3.0715 5.0370 6.5162 2.5208 8.0464 2.5348 35.5948 8.3559 22.9048 1.6917 2.6070 10.6393 2.1053 4.3946 10.4970 14.0150 14.6549 6.4315 115.1935 23.3310 97.3481 44.3363 84.1043 63.5557 22.9912 17.0773 45.7808 8.8321 35.0913 55.4902 44.5647 34.6694 37.4671 23.5324 3.9658 3.9070 4.6164
temp: 298.150 k
press: 1.00000 atm
elementType: 8 8 8 7 6 6 6 6 6 6 6 6 1 1 1 1 1 1 1 1 1 1 1 1 1 1 1 1 1 1 1
symmnumber: 1
zpe: 704877.2 jmol-1
zpe.correction: 0.268474 hartree
zpe.thermalcorrener: 0.284517 hartree
zpe.thermalcorrenthalpy: 0.285462 hartree
zpe.thermalcorrgfe: 0.223992 hartree
zpe.sumelectzpe: -595.597614 hartree
zpe.sumelectthermal: -595.581570 hartree
zpe.sumelectthermalent: -595.580626 hartree
zpe.sumelectthermalfe: -595.642096 hartree
dipole: 1.4414 0.7132 1.7284
dipole: 2.3608
quadrupole: -80.0879 -76.5167 -73.4193
quadrupole: -3.9644 10.4158 3.0364
quadrupole: -3.4133 0.1579 3.2554 -3.9644 10.4158 3.0364
hfenergy: -595.8660876 hartree
pointgroup: C01 [X(C8H19N1O3)]
dipole: -0.465806 -0.3048917 0.7434828 debye
polarizability: 111.6588555|-0.8028299|109.5388754|-5.6395351|-0.377338|98.5717105 unknown
InChI: InChI=1S/C8H19NO3/c1-7(11)5-9(3-4-10)6-8(2)12/h7-8,10-12H,3-6H2,1-2H3
charge 0 multiplicity 1
31 atoms
O  -3.223968 1.623928 -0.518056
O  3.292063 1.689185 -0.770318
O  0.253438 -3.874005 0.30174
N  0.019351 -0.217839 -0.450081
C  -1.376206 0.140076 -0.800654
C  1.036306 0.700888 -1.006185
C  0.338569 -1.655441 -0.622108
C  -1.964839 1.210143 0.141626
C  2.263791 0.882411 -0.076744
C  -0.084578 -2.47345 0.606017
C  -2.213515 0.688039 1.564462
C  1.935363 1.63745 1.210773
H  -1.464782 0.519137 -1.844277
H  -2.012159 -0.761994 -0.733806
H  1.395771 0.356339 -2.011136
H  0.581377 1.696885 -1.160053
H  1.42923 -1.775624 -0.751142
H  -0.142252 -2.093522 -1.526608
H  -1.267574 2.075681 0.183559
H  2.680875 -0.118899 0.17222
H  -1.174358 -2.357707 0.788972
H  0.463347 -2.10555 1.498568
H  -1.277377 0.269207 1.97475
H  -2.983798 -0.10541 1.552072
H  -2.554571 1.495216 2.240798
H  1.118855 1.122447 1.745439
H  1.618264 2.668706 0.971397
H  2.821821 1.692837 1.865227
H  -3.712094 2.241681 0.082788
H  3.529518 1.242811 -1.623823
H  -0.006667 -4.450825 1.06238
