program: Orca
programVersion: 5.0.2
elementType: Br Cl S P O O O C C C C C C C C C C C H H H H H H H H H H H H H H H
charge: 0
multiplicity: 1
keywords: wb97x-d3
keywords: def2-TZVPP
keywords: def2/J RIJCOSX
keywords: DEFGRID2
keywords: scfconv7
keywords: smallprint printgap noloewdin
keywords: NOSOSCF
formula: C11H15BrClO3PS
InChI: InChI=1/C11H15BrClO3PS/c1-3-7-18-17(14,15-4-2)16-11-6-5-9(12)8-10(11)13/h5-6,8H,3-4,7H2,1-2H3
33 atoms
Br 4.559799 0.592208 1.318537
Cl 0.216122 2.718655 -1.315018
S  -2.442552 -1.900055 0.173555
P  -2.173023 -0.067396 -0.735287
O  -0.72592 -0.047569 -1.47051
O  -1.896033 0.885633 0.499421
O  -3.216067 0.279061 -1.723617
C  -3.148166 -2.848142 -1.236917
C  -3.374261 -4.289235 -0.813092
C  -4.395306 -4.455577 0.300448
C  0.463225 0.084671 -0.80513
C  -2.965103 1.412514 1.324122
C  1.029866 1.346823 -0.669358
C  1.128019 -1.025651 -0.316981
C  -3.525636 2.686573 0.746983
C  2.253411 1.505552 -0.040689
C  2.353016 -0.882899 0.315187
C  2.899855 0.383117 0.454269
H  -2.451847 -2.797146 -2.072442
H  -4.085824 -2.378059 -1.52871
H  -3.71844 -4.819623 -1.704318
H  -2.42369 -4.747689 -0.532037
H  -5.347266 -3.993781 0.033718
H  -4.582512 -5.51123 0.496032
H  -4.061825 -4.008099 1.238034
H  -3.742538 0.656576 1.456318
H  -2.506002 1.588473 2.294888
H  0.694687 -2.009176 -0.440223
H  -2.742523 3.427393 0.585564
H  -4.045572 2.514016 -0.194415
H  -4.243437 3.106588 1.452283
H  2.681166 2.494305 0.053382
H  2.859005 -1.760925 0.691474
elementType: Br Cl S P O C H
totalener: -4428.05403978 hartree
nucrepener: 2225.08716525 hartree
electener: -6653.14120502 hartree
twoeener: 3909.39454032 hartree
cpcmener: -0.02744960 hartree
kineticenergy: 4419.42580415 hartree
xcener: -190.172080523455 hartree
chargesum: -0.0000000
charge: -0.028514 -0.063805 -0.182675 0.820888 -0.355877 -0.329026 -0.625591 -0.088718 -0.110524 -0.256764 0.249645 0.040140 -0.014220 -0.171004 -0.242759 -0.050217 -0.092802 -0.068902 0.132601 0.112980 0.080257 0.075240 0.085617 0.094637 0.076490 0.096478 0.110310 0.156615 0.084209 0.082843 0.100175 0.131797 0.150479
qa: -0.0285 -0.0638 -0.1827 0.8209 -0.3559 -0.3290 -0.6256 -0.0887 -0.1105 -0.2568 0.2496 0.0401 -0.0142 -0.1710 -0.2428 -0.0502 -0.0928 -0.0689 0.1326 0.1130 0.0803 0.0752 0.0856 0.0946 0.0765 0.0965 0.1103 0.1566 0.0842 0.0828 0.1002 0.1318 0.1505
va: 1.2233 1.2505 2.2973 5.4883 2.1049 2.1002 1.9854 3.8861 3.9236 3.9319 3.7754 3.8463 4.0016 4.0351 3.9340 3.8935 3.9012 3.9944 1.0055 1.0187 1.0054 1.0124 1.0008 1.0044 1.0057 1.0027 0.9914 1.0003 1.0078 1.0177 1.0091 1.0080 0.9934
dispcorr: -0.016251933 hartree
energy: -4428.070291709600
dipole: -76.13826 75.99854 -0.13972 -26.17574 24.70526 -1.47048 -8.08961 9.49508 1.40547
magnitude: 2.03892 au
magnitude: 5.18251 debye
