program: Orca
programVersion: 5.0.2
elementType: Br Cl S P O O O C C C C C C C C C C C H H H H H H H H H H H H H H H
charge: 0
multiplicity: 1
keywords: wb97x-d3
keywords: def2-TZVPP
keywords: def2/J RIJCOSX
keywords: DEFGRID2
keywords: scfconv7
keywords: smallprint printgap noloewdin
keywords: NOSOSCF
formula: C11H15BrClO3PS
InChI: InChI=1/C11H15BrClO3PS/c1-3-7-18-17(14,15-4-2)16-11-6-5-9(12)8-10(11)13/h5-6,8H,3-4,7H2,1-2H3
33 atoms
Br 4.847534 -0.285177 -0.035636
Cl -0.015789 0.897695 2.273517
S  -2.081608 -1.094412 0.204846
P  -2.06142 0.513093 -1.088983
O  -0.895388 1.447812 -0.44723
O  -3.338477 1.414852 -0.853025
O  -1.894001 0.171751 -2.518219
C  -3.122874 -2.240246 -0.791733
C  -3.522352 -3.429501 0.065557
C  -4.450684 -3.081556 1.217641
C  0.408526 1.032173 -0.381238
C  -3.831738 1.795985 0.454499
C  0.95992 0.752714 0.863359
C  1.189088 0.927985 -1.519628
C  -5.108707 1.060265 0.763868
C  2.285199 0.365201 0.978209
C  2.515121 0.540072 -1.421338
C  3.049055 0.256118 -0.173798
H  -2.542825 -2.558536 -1.655389
H  -4.008027 -1.706432 -1.138347
H  -4.02034 -4.134663 -0.604053
H  -2.629705 -3.940716 0.433792
H  -5.34894 -2.576299 0.859026
H  -4.765602 -3.98329 1.742706
H  -3.973086 -2.429678 1.950056
H  -3.078026 1.611682 1.222131
H  -3.995225 2.871287 0.406088
H  0.769723 1.16675 -2.487447
H  -4.943913 -0.013455 0.857381
H  -5.503793 1.42104 1.713695
H  -5.866003 1.23404 -0.000305
H  2.696564 0.150806 1.955398
H  3.111075 0.465144 -2.320138
elementType: Br Cl S P O C H
totalener: -4428.05529207 hartree
nucrepener: 2242.28154319 hartree
electener: -6670.33683525 hartree
twoeener: 3926.33325164 hartree
cpcmener: -0.02690058 hartree
kineticenergy: 4419.42272447 hartree
xcener: -190.172897045536 hartree
chargesum: -0.0000000
charge: -0.027642 -0.060386 -0.196054 0.838490 -0.350273 -0.345163 -0.630270 -0.098649 -0.093104 -0.275603 0.231651 0.050392 -0.016703 -0.174222 -0.215387 -0.046237 -0.084263 -0.072684 0.129292 0.122159 0.081359 0.075102 0.084126 0.104792 0.079860 0.086166 0.110830 0.156976 0.057952 0.098041 0.095197 0.133137 0.151118
qa: -0.0276 -0.0604 -0.1961 0.8385 -0.3503 -0.3452 -0.6303 -0.0986 -0.0931 -0.2756 0.2317 0.0504 -0.0167 -0.1742 -0.2154 -0.0462 -0.0843 -0.0727 0.1293 0.1222 0.0814 0.0751 0.0841 0.1048 0.0799 0.0862 0.1108 0.1570 0.0580 0.0980 0.0952 0.1331 0.1511
va: 1.2232 1.2517 2.2927 5.4803 2.1038 2.1072 1.9825 3.9052 3.8906 3.9302 3.7727 3.8534 4.0138 4.0420 3.9323 3.8866 3.8862 3.9927 1.0171 1.0055 1.0067 1.0117 0.9980 1.0062 1.0063 1.0037 0.9979 1.0085 1.0063 1.0110 1.0059 1.0067 0.9926
dispcorr: -0.017169737 hartree
energy: -4428.072461802381
dipole: -84.53491 83.38985 -1.14506 -10.60424 10.11521 -0.48903 0.99036 0.42389 1.41425
magnitude: 1.88425 au
magnitude: 4.78938 debye
