program: Orca
programVersion: 5.0.2
elementType: Br Cl S P O O O C C C C C C C C C C C H H H H H H H H H H H H H H H
charge: 0
multiplicity: 1
keywords: wb97x-d3
keywords: def2-TZVPP
keywords: def2/J RIJCOSX
keywords: DEFGRID2
keywords: scfconv7
keywords: smallprint printgap noloewdin
keywords: NOSOSCF
formula: C11H15BrClO3PS
InChI: InChI=1/C11H15BrClO3PS/c1-3-7-18-17(14,15-4-2)16-11-6-5-9(12)8-10(11)13/h5-6,8H,3-4,7H2,1-2H3
33 atoms
Br 4.382567 0.089796 1.339512
Cl 0.312068 2.692408 -1.303417
S  -2.666751 -1.585804 0.362734
P  -2.372687 0.152165 -0.699168
O  -0.941213 0.04922 -1.456829
O  -2.046311 1.201072 0.439314
O  -3.420605 0.448065 -1.698313
C  -3.288324 -2.674253 -0.984099
C  -3.195229 -4.126508 -0.549537
C  -1.770621 -4.63129 -0.389388
C  0.259301 0.045751 -0.7974
C  -3.075415 1.891029 1.188633
C  0.964232 1.236268 -0.659374
C  0.797184 -1.132924 -0.310977
C  -3.47678 3.170768 0.501574
C  2.19725 1.256304 -0.028041
C  2.028366 -1.128665 0.325277
C  2.711879 0.0685 0.469051
H  -2.688554 -2.508836 -1.879098
H  -4.317101 -2.390231 -1.19454
H  -3.762547 -4.279655 0.371716
H  -3.705697 -4.709747 -1.319661
H  -1.244078 -4.127812 0.422404
H  -1.763612 -5.698547 -0.168312
H  -1.196022 -4.478576 -1.304456
H  -3.933938 1.234404 1.344031
H  -2.629722 2.088014 2.161339
H  0.260427 -2.063804 -0.437478
H  -2.613364 3.811975 0.324729
H  -3.974093 2.982465 -0.449151
H  -4.17211 3.713173 1.142255
H  2.733067 2.190536 0.069403
H  2.431544 -2.057531 0.703777
elementType: Br Cl S P O C H
totalener: -4428.05425243 hartree
nucrepener: 2247.00766639 hartree
electener: -6675.06191882 hartree
twoeener: 3931.14202771 hartree
cpcmener: -0.02799961 hartree
kineticenergy: 4419.43629131 hartree
xcener: -190.174663429741 hartree
chargesum: 0.0000000
charge: -0.029114 -0.064051 -0.177503 0.814410 -0.354503 -0.328193 -0.626637 -0.091555 -0.095225 -0.273653 0.202733 0.038986 0.019206 -0.124799 -0.241216 -0.076848 -0.143936 -0.033506 0.115300 0.126073 0.074768 0.080388 0.075843 0.103458 0.084885 0.098289 0.110627 0.172324 0.083287 0.082411 0.100549 0.130695 0.146505
qa: -0.0291 -0.0641 -0.1775 0.8144 -0.3545 -0.3282 -0.6266 -0.0916 -0.0952 -0.2737 0.2027 0.0390 0.0192 -0.1248 -0.2412 -0.0768 -0.1439 -0.0335 0.1153 0.1261 0.0748 0.0804 0.0758 0.1035 0.0849 0.0983 0.1106 0.1723 0.0833 0.0824 0.1005 0.1307 0.1465
va: 1.2226 1.2493 2.2946 5.5034 2.1022 2.1066 1.9839 3.8891 3.8992 3.9386 3.8258 3.8463 3.9781 3.9853 3.9360 3.9249 3.9654 3.9759 1.0115 1.0142 1.0107 1.0060 1.0044 1.0056 0.9987 1.0009 0.9915 0.9724 1.0080 1.0174 1.0089 1.0098 0.9981
dispcorr: -0.017089565 hartree
energy: -4428.071341998094
dipole: -67.68487 67.59832 -0.08655 -19.76410 18.39193 -1.37217 -10.26084 11.67550 1.41466
magnitude: 1.97271 au
magnitude: 5.01423 debye
