program: Orca
programVersion: 5.0.2
elementType: Br Cl S P O O O C C C C C C C C C C C H H H H H H H H H H H H H H H
charge: 0
multiplicity: 1
keywords: wb97x-d3
keywords: def2-TZVPP
keywords: def2/J RIJCOSX
keywords: DEFGRID2
keywords: scfconv7
keywords: smallprint printgap noloewdin
keywords: NOSOSCF
formula: C11H15BrClO3PS
InChI: InChI=1/C11H15BrClO3PS/c1-3-7-18-17(14,15-4-2)16-11-6-5-9(12)8-10(11)13/h5-6,8H,3-4,7H2,1-2H3
33 atoms
Br 4.559376 0.154137 1.089736
Cl 0.52707 -0.447506 -2.608116
S  -1.805986 -1.460984 0.030462
P  -2.343247 0.491585 -0.36186
O  -1.017911 1.293805 -0.846309
O  -2.535408 1.117452 1.08492
O  -3.430482 0.69334 -1.345596
C  -2.355939 -2.341059 -1.487754
C  -3.578765 -3.202879 -1.23033
C  -4.827136 -2.43457 -0.835877
C  0.239833 1.02787 -0.37352
C  -3.6818 0.763927 1.90016
C  1.086774 0.2224 -1.125896
C  0.69008 1.580463 0.812646
C  -3.941927 1.892837 2.860277
C  2.378157 -0.036759 -0.698836
C  1.979948 1.330229 1.25396
C  2.809267 0.517353 0.496624
H  -1.505258 -2.950305 -1.78819
H  -2.534394 -1.615702 -2.279331
H  -3.765442 -3.756377 -2.154948
H  -3.342346 -3.952197 -0.471404
H  -5.668682 -3.115268 -0.707751
H  -4.694251 -1.902171 0.107233
H  -5.106273 -1.704954 -1.596642
H  -4.551052 0.590607 1.262761
H  -3.454765 -0.162681 2.429205
H  0.038806 2.220668 1.392312
H  -4.791579 1.631071 3.490654
H  -3.085971 2.071996 3.510812
H  -4.185541 2.816015 2.33525
H  3.023591 -0.666052 -1.29602
H  2.315082 1.771722 2.18213
elementType: Br Cl S P O C H
totalener: -4428.05501961 hartree
nucrepener: 2257.18802201 hartree
electener: -6685.24304162 hartree
twoeener: 3941.39965407 hartree
cpcmener: -0.02686284 hartree
kineticenergy: 4419.42485621 hartree
xcener: -190.172470229967 hartree
chargesum: -0.0000000
charge: -0.027941 -0.060372 -0.178951 0.833025 -0.356454 -0.337747 -0.629155 -0.081821 -0.082288 -0.270191 0.173359 0.038363 0.021113 -0.132164 -0.247203 -0.066604 -0.101538 -0.053710 0.126699 0.107600 0.076865 0.069647 0.099924 0.069972 0.083382 0.108457 0.104967 0.160097 0.091485 0.090787 0.089131 0.130795 0.150469
qa: -0.0279 -0.0604 -0.1790 0.8330 -0.3565 -0.3377 -0.6292 -0.0818 -0.0823 -0.2702 0.1734 0.0384 0.0211 -0.1322 -0.2472 -0.0666 -0.1015 -0.0537 0.1267 0.1076 0.0769 0.0696 0.0999 0.0700 0.0834 0.1085 0.1050 0.1601 0.0915 0.0908 0.0891 0.1308 0.1505
va: 1.2233 1.2544 2.2834 5.4987 2.1216 2.1177 1.9725 3.8572 3.9112 3.9379 3.8144 3.8399 3.9737 3.9976 3.9792 3.9320 3.8964 3.9857 1.0088 1.0295 1.0089 1.0115 1.0091 1.0047 1.0063 0.9889 0.9927 1.0023 1.0057 1.0018 1.0057 1.0096 0.9931
dispcorr: -0.017622916 hartree
energy: -4428.072642524581
dipole: -79.67458 79.60278 -0.07180 -9.34897 8.34534 -1.00363 -0.23716 1.91320 1.67605
magnitude: 1.95488 au
magnitude: 4.96891 debye
