program: Gaussian 09
title: 000066312
version: EM64L-G09RevD.01
frameworkgroup: C1[X(C9H9BrO)]
method: RPBEPBE
basis: SDD
operation: Freq
keyword: #p
keyword: freq=noraman
keyword: PBEPBE/SDD
title: #p freq=noraman PBEPBE/SDD
converged: NO YES NO NO
title: Mulliken charges:
elementType: Br O C C C C C C C C C H H H H H H H H H
charge: 0.028068 -0.220184 0.300692 -0.483202 0.134704 -0.335491 -0.338394 -0.682362 -0.194369 -0.188210 -0.206869 0.232669 0.232637 0.251188 0.284589 0.231723 0.210592 0.231586 0.254008 0.256625
chargesum: 0.00000
title: Mulliken charges with hydrogens summed into heavy atoms:
elementType: Br O C C C C C C C C C
charge: 0.028068 -0.220184 0.300692 -0.017896 0.134704 -0.084302 -0.053805 -0.008461 0.059639 0.068415 -0.206869
polarizability: 1.95516741e+02 -4.13753952e+00 1.05188454e+02 6.16454126e-03 1.27745614e-02 5.22958516e+01
1716.lowfreq: -3.1888 -0.0005 0.0001 0.0006 5.7528 18.0215 44.8148 70.4654 85.4538
frequency: 44.7937 70.4438 85.4369 116.6072 175.0570 219.0554 235.4345 244.1812 303.6811 404.8491 405.0544 455.6884 480.6491 563.4892 620.7930 654.9226 716.9087 741.8910 794.9774 836.3844 856.3346 946.2915 966.5380 996.2221 997.3372 1018.9480 1059.2862 1070.3833 1091.3979 1111.9095 1186.9282 1222.7144 1247.7958 1294.5325 1334.9006 1367.7618 1393.8945 1396.7103 1436.1110 1467.8153 1469.9381 1476.6977 1560.3719 1586.2294 1604.8949 2967.7964 2998.5320 3013.8939 3094.7117 3103.1587 3149.7415 3151.7828 3171.4378 3175.0593
redmass: 3.7291 3.5986 2.3393 4.8877 1.2958 9.5288 4.7372 4.4471 4.5477 5.2553 2.8743 3.2216 6.6199 2.2070 7.0877 4.7860 3.3805 4.5612 1.3856 1.3055 1.4355 4.4753 1.3546 4.3966 1.3504 1.5830 2.6274 1.6636 2.7293 1.3766 1.1377 2.6884 1.1819 1.2640 2.0013 5.1078 3.3552 1.2709 1.1083 1.0388 2.2653 1.0580 7.5536 6.4242 7.9391 1.0601 1.0363 1.0980 1.1003 1.0999 1.0881 1.0889 1.0962 1.0973
irintensity: 0.1111 3.9742 0.0019 1.2776 0.8870 1.5817 2.3698 0.0718 10.0073 2.6343 0.0552 13.0444 16.6634 10.8861 1.3363 1.9824 0.2033 12.2091 59.2645 1.4206 24.7238 86.3710 0.0018 44.3386 0.6395 8.9766 47.5634 1.9023 1.7037 11.9498 25.0725 142.7711 0.2974 0.4965 59.5269 18.2391 29.9700 20.2005 21.2337 12.1242 18.7965 14.5372 80.4741 142.7401 41.3777 36.0997 30.0829 10.1054 26.5239 30.0287 5.0551 0.4356 8.5472 1.4230
temp: 298.150 k
press: 1.00000 atm
elementType: 35 8 6 6 6 6 6 6 6 6 6 1 1 1 1 1 1 1 1 1
symmnumber: 1
zpe: 401696.2 jmol-1
zpe.correction: 0.152998 hartree
zpe.thermalcorrener: 0.163897 hartree
zpe.thermalcorrenthalpy: 0.164842 hartree
zpe.thermalcorrgfe: 0.114515 hartree
zpe.sumelectzpe: -436.242540 hartree
zpe.sumelectthermal: -436.231640 hartree
zpe.sumelectthermalent: -436.230696 hartree
zpe.sumelectthermalfe: -436.281023 hartree
dipole: 0.0034 -2.5443 0.0023
dipole: 2.5443
quadrupole: -79.7713 -70.4166 -76.3695
quadrupole: 10.6207 -0.0083 0.0124
quadrupole: -4.2522 5.1025 -0.8504 10.6207 -0.0083 0.0124
hfenergy: -436.3955377 hartree
pointgroup: C01 [X(C9H9Br1O1)]
dipole: -0.0156488 1.0008775 0.0014673 debye
dipolederiv: -0.8405603 -0.060489 -0.0012254 -0.0670927 -0.0624672 -0.000196 -0.0012577 -0.0001899 -0.0257114 -0.9506874 -0.1040111 -0.0011028 -0.3735069 -0.7440324 -0.0013534 -0.0012841 -0.0006626 -0.2970684 -0.9158612 -0.0212584 -0.0011114 0.0628005 -0.106324 -0.0000596 -0.0013252 -0.0001349 -0.0138403 -0.1529058 0.1134028 -0.0000468 0.3293294 -0.2630294 -0.0007454 0.0015116 -0.0016272 0.1497659 1.8500261 -0.0101389 0.0019816 0.018373 0.8377288 0.0013617 0.0018879 0.0014101 0.1079592 0.2250305 -0.0741971 0.0002675 0.1917076 0.033206 0.0007326 0.0005512 0.0002928 -0.1253336 0.1550865 0.1331062 0.0007201 -0.2130277 0.0285755 0.0001377 -0.0000904 0.0004581 -0.0942673 -0.0419646 -0.0242543 -0.000226 -0.0038606 0.0848829 0.0001386 -0.000338 0.0002676 0.0611623 -0.5923415 0.1288391 -0.000248 0.1493748 0.0200233 0.0005445 -0.0001719 0.000558 -0.0966272 -0.4879169 -0.2411412 -0.0011958 -0.1869358 -0.024801 -0.0000149 -0.0010115 -0.0001278 -0.0970414 1.4765726 0.1117961 0.002382 0.0889404 0.1314675 0.000834 0.0022833 0.0008841 -0.1172455 -0.0088285 -0.0306786 -0.0804872 -0.0547081 0.0345076 -0.0755622 -0.0909378 -0.0905197 -0.0276759 -0.0094137 -0.0316874 0.0803648 -0.0557832 0.0333773 0.0759496 0.0903169 0.0910748 -0.025943 0.0313331 0.0898806 0.0001244 0.0976386 -0.012729 -0.0003216 0.0001646 -0.000309 0.1426625 0.0999111 -0.0688244 -0.000309 -0.0100677 0.0266082 -0.0004173 -0.0002077 -0.0004117 0.1542998 0.0651557 -0.0120558 0.0229948 -0.0777795 0.0429264 0.1059712 0.0549648 0.0882404 -0.0599134 -0.052149 0.099319 0.0000061 0.1731478 -0.0935785 -0.0003263 0.0002158 -0.0004653 0.1034094 0.0651408 -0.0115568 -0.0226259 -0.0769209 0.0440515 -0.1057021 -0.0550339 -0.0877454 -0.061658 0.0554335 -0.0613189 -0.0003126 -0.0633423 -0.019032 -0.0006203 -0.0002871 -0.0006405 0.1620052 0.028939 0.0752683 0.00005 0.0717134 0.0086383 -0.0003509 0.0000492 -0.0003521 0.1610612 unknown
polarizability: 195.3502524|5.6659132|105.3542963|0.200967|0.147348|52.2964982 unknown
InChI: InChI=1S/C9H9BrO/c1-2-9(11)7-3-5-8(10)6-4-7/h3-6H,2H2,1H3
charge 0 multiplicity 1
20 atoms
Br 4.461608 0.26568 0.005978
O  -2.300531 -1.466109 -0.005434
C  -0.304097 -0.12291 -0.001441
C  -2.691619 0.942422 -0.002058
C  -1.799799 -0.303363 -0.003864
C  0.31751 1.154832 0.0031
C  0.517139 -1.282953 -0.003677
C  -4.193649 0.61199 -0.00608
C  1.723068 1.276165 0.00537
C  1.921397 -1.180507 -0.001539
C  2.508848 0.104318 0.002982
H  -2.431426 1.556961 0.884603
H  -2.427781 1.563052 -0.883216
H  -0.286182 2.067981 0.004959
H  0.027412 -2.262452 -0.007081
H  -4.466675 0.011935 0.878482
H  -4.794615 1.538948 -0.004309
H  -4.463261 0.017669 -0.895584
H  2.197404 2.261473 0.008935
H  2.547048 -2.077531 -0.003328
