program: Orca
programVersion: 5.0.2
elementType: Br Cl S P O O O C C C C C C C C C C C H H H H H H H H H H H H H H H
charge: 0
multiplicity: 1
keywords: wb97x-d3
keywords: def2-TZVPP
keywords: def2/J RIJCOSX
keywords: DEFGRID2
keywords: scfconv7
keywords: smallprint printgap noloewdin
keywords: NOSOSCF
formula: C11H15BrClO3PS
InChI: InChI=1/C11H15BrClO3PS/c1-3-7-18-17(14,15-4-2)16-11-6-5-9(12)8-10(11)13/h5-6,8H,3-4,7H2,1-2H3
33 atoms
Br 4.525862 1.238828 -0.425493
Cl -0.227978 1.496778 2.34797
S  -3.890572 -1.221594 0.499205
P  -2.23589 -0.379342 -0.383944
O  -1.043197 -0.767441 0.664385
O  -2.436072 1.170742 -0.123659
O  -1.956679 -0.796335 -1.777841
C  -3.906422 -2.851154 -0.340454
C  -2.81545 -3.803338 0.110203
C  -2.9287 -5.131243 -0.623291
C  0.228345 -0.317334 0.40644
C  -2.375773 2.161659 -1.177973
C  0.737491 0.751575 1.134477
C  1.014412 -0.92907 -0.55623
C  -0.957028 2.591764 -1.452055
C  2.021685 1.218401 0.899215
C  2.298707 -0.474199 -0.803664
C  2.786094 0.603231 -0.079903
H  -3.884414 -2.683189 -1.416594
H  -4.892461 -3.250127 -0.096981
H  -1.831245 -3.370749 -0.079446
H  -2.889746 -3.958616 1.188132
H  -2.165037 -5.830004 -0.28242
H  -3.90144 -5.597164 -0.458013
H  -2.80119 -5.000067 -1.69889
H  -2.85499 1.776914 -2.078728
H  -2.973639 2.993923 -0.812649
H  0.629512 -1.77825 -1.104344
H  -0.345803 1.769982 -1.827809
H  -0.967641 3.371461 -2.214624
H  -0.482871 3.003224 -0.561358
H  2.400725 2.052715 1.473892
H  2.899212 -0.963419 -1.557855
elementType: Br Cl S P O C H
totalener: -4428.05463330 hartree
nucrepener: 2257.14833820 hartree
electener: -6685.20297150 hartree
twoeener: 3941.55196280 hartree
cpcmener: -0.02377066 hartree
kineticenergy: 4419.42729691 hartree
xcener: -190.169135846988 hartree
chargesum: 0.0000000
charge: -0.028838 -0.064963 -0.163030 0.838803 -0.352248 -0.360355 -0.629014 -0.088740 -0.088114 -0.269347 0.268337 0.041304 -0.034747 -0.185086 -0.254336 -0.051508 -0.085022 -0.065773 0.115657 0.132445 0.059195 0.069012 0.093973 0.085365 0.085985 0.100383 0.110161 0.154130 0.087177 0.111999 0.086431 0.129563 0.151199
qa: -0.0288 -0.0650 -0.1630 0.8388 -0.3522 -0.3604 -0.6290 -0.0887 -0.0881 -0.2693 0.2683 0.0413 -0.0347 -0.1851 -0.2543 -0.0515 -0.0850 -0.0658 0.1157 0.1324 0.0592 0.0690 0.0940 0.0854 0.0860 0.1004 0.1102 0.1541 0.0872 0.1120 0.0864 0.1296 0.1512
va: 1.2231 1.2434 2.3136 5.4436 2.0710 2.1133 1.9473 3.8565 3.8979 3.9537 3.7550 3.8549 4.0193 4.0084 3.9125 3.8951 3.8796 3.9860 1.0251 1.0014 1.0201 1.0154 1.0036 1.0009 1.0009 1.0034 0.9916 1.0035 1.0084 1.0109 1.0060 1.0097 0.9938
dispcorr: -0.018387464 hartree
energy: -4428.073020765320
dipole: -62.27061 61.92199 -0.34862 -29.54747 29.30113 -0.24634 -9.65131 9.32321 -0.32810
magnitude: 0.53840 au
magnitude: 1.36850 debye
