program: Gaussian 09
title: 000066325
version: EM64L-G09RevD.01
frameworkgroup: C1[X(C12H13N)]
method: RPBEPBE
basis: SDD
operation: Freq
keyword: #pfreq=noraman
keyword: PBEPBE/SDD
title: #p freq=noraman PBEPBE/SDD
converged: YES YES NO NO
title: Mulliken charges:
elementType: N C C C C C C C C C C C C H H H H H H H H H H H H H
charge: -0.571981 0.348877 -0.234456 0.129298 0.410323 -0.426452 -0.735282 -0.343458 -0.453573 -0.265140 -0.431294 -0.266153 -0.243263 0.218682 0.244514 0.207698 0.214799 0.221256 0.289490 0.236938 0.223335 0.234636 0.266729 0.275447 0.223681 0.225350
chargesum: 0.00000
title: Mulliken charges with hydrogens summed into heavy atoms:
elementType: N C C C C C C C C C C C C
charge: -0.029805 0.348877 -0.015774 0.129298 0.410323 -0.181939 -0.091529 -0.053968 -0.216636 -0.041804 -0.196658 -0.042472 -0.017913
polarizability: 1.78600237e+02 -1.31132252e+01 1.60233417e+02 1.45134994e+00 4.69607207e+00 6.96064346e+01
1716.lowfreq: -11.0928 -0.0010 -0.0007 -0.0005 6.0030 13.1103 66.4317 96.7439 176.3640
frequency: 66.3002 96.7264 176.3637 181.0057 203.5297 244.7384 289.3998 308.4370 330.9594 391.1965 437.3845 448.7803 471.6314 492.6333 524.1541 558.5919 599.9436 631.6887 659.8056 690.9062 744.4543 785.9389 791.2253 812.1333 822.9023 878.6108 895.9203 918.7659 959.8191 982.2060 985.5440 991.0262 998.2019 1030.9223 1060.3189 1094.6785 1118.1705 1151.1117 1162.3434 1176.2909 1186.4307 1235.0230 1249.7431 1273.5523 1330.8225 1346.5847 1378.9746 1383.1265 1405.6844 1420.1671 1439.9835 1457.6231 1472.9110 1475.6761 1514.4853 1590.2630 1600.9329 1631.7554 1633.0880 2948.7605 2969.8826 3066.0175 3072.8807 3118.0321 3120.3898 3131.9156 3141.7252 3153.0219 3162.0636 3172.6016 3432.4056 3565.2879
redmass: 3.2510 3.4595 3.8941 3.5965 3.1237 1.1519 1.0836 2.8353 3.8041 2.8745 3.0740 2.9883 3.2861 4.0149 5.7766 4.0408 3.1570 1.6710 3.0586 3.5152 1.3345 4.4802 1.9988 1.5563 3.7998 1.7541 2.1636 1.4250 1.3785 1.4499 1.8515 1.3551 1.9800 2.2872 2.5273 2.5461 1.6979 1.4159 1.7881 1.0973 1.2511 1.9362 1.7556 1.7166 1.5527 1.2337 1.7376 1.4025 2.7711 5.1393 2.4503 2.4684 1.0509 1.0655 3.7961 7.1414 5.0785 1.1051 6.3164 1.0833 1.0354 1.0993 1.1000 1.0861 1.0860 1.0902 1.0929 1.0968 1.0965 1.0963 1.0446 1.0975
irintensity: 0.9503 0.7916 4.7712 0.4550 3.1919 45.8165 0.4544 2.2555 5.7366 3.6349 11.2077 11.4692 0.1671 5.8176 1.8284 10.6850 2.6058 152.1600 22.5405 4.7294 3.9638 6.4899 69.0286 66.2497 3.7243 3.4579 2.3673 0.3024 1.7252 3.3260 4.3049 1.3188 3.7501 8.2777 10.0996 8.9445 9.0664 2.7310 10.3143 2.7535 2.2371 3.2275 3.7273 3.9479 22.3778 17.6007 2.8940 14.0189 5.4255 1.9463 1.7023 0.0180 10.6571 3.9981 13.1806 0.6582 5.9817 46.3161 0.6057 27.4249 28.2571 40.3794 40.9996 0.6784 2.0289 19.8930 26.2463 36.0549 26.5276 12.7821 4.9059 0.5319
temp: 298.150 k
press: 1.00000 atm
elementType: 7 6 6 6 6 6 6 6 6 6 6 6 6 1 1 1 1 1 1 1 1 1 1 1 1 1
symmnumber: 1
zpe: 569701.0 jmol-1
zpe.correction: 0.216988 hartree
zpe.thermalcorrener: 0.228185 hartree
zpe.thermalcorrenthalpy: 0.229129 hartree
zpe.thermalcorrgfe: 0.180527 hartree
zpe.sumelectzpe: -518.902896 hartree
zpe.sumelectthermal: -518.891699 hartree
zpe.sumelectthermalent: -518.890754 hartree
zpe.sumelectthermalfe: -518.939356 hartree
dipole: -1.5476 0.1522 0.2288
dipole: 1.5718
quadrupole: -64.8147 -70.7663 -80.7850
quadrupole: 2.4861 -1.1376 1.3711
quadrupole: 7.3073 1.3557 -8.6630 2.4861 -1.1376 1.3711
hfenergy: -519.1198832 hartree
pointgroup: C01 [X(C12H13N1)]
dipole: -0.617292 0.0363623 0.0067501 debye
dipolederiv: -0.633198 0.0585966 -0.1044597 0.099316 -0.3958806 0.2626244 -0.1009791 0.1797084 -0.5183498 0.0592496 0.0537612 0.0022582 0.1327339 0.0572489 0.0451199 -0.0068398 0.0259541 -0.1177312 0.4932512 0.0813346 -0.0055818 0.0134207 0.23499 -0.1070717 0.0480072 -0.12431 0.5438813 -0.0358473 -0.1132038 0.0003157 -0.2196112 -0.0270226 -0.0326657 0.0155145 -0.0354132 0.0081346 0.0084259 -0.1172184 -0.0042125 -0.0700057 -0.0376099 0.0041486 -0.0021205 0.0006043 0.0588449 0.0185305 0.0238854 0.0445945 -0.0291906 -0.1185595 -0.0117191 0.0451767 -0.0085323 -0.1435823 -0.1632432 0.0472096 -0.1154016 -0.0153184 0.0354836 0.0558496 -0.0434193 0.074494 -0.008702 -0.043765 0.0893225 -0.014025 0.071583 -0.0011939 -0.0171691 -0.0202876 -0.0379135 -0.1448321 0.0138632 0.0903602 0.0201073 0.014839 0.0513457 -0.0223391 0.0247972 -0.013491 -0.1792855 -0.1020703 -0.0206718 0.0115685 0.0319438 0.1276775 -0.0224269 0.0080444 -0.032954 -0.1585512 0.0257852 0.0577989 0.0254408 0.1139154 0.0184535 -0.0050735 0.0186976 -0.0144629 -0.1812923 -0.085983 -0.0219261 0.0180393 0.0135437 0.1386893 -0.0326729 0.0147618 -0.0480284 -0.1597315 0.1203173 0.0236478 0.0369915 -0.0095923 -0.0773613 -0.0111284 0.0327307 -0.006147 -0.1552799 -0.0196863 0.0501483 0.0577837 0.0057461 -0.0895407 -0.0965677 0.0497905 -0.0405844 -0.0692072 -0.0945411 0.060294 -0.0459903 0.0732976 0.0990205 0.0185564 -0.0484917 0.0137599 0.1244115 0.0508752 0.0441744 0.026772 0.1157314 -0.0294043 -0.0861699 0.0591601 -0.1022738 -0.01911 -0.0616866 -0.106183 -0.0245698 -0.1800448 -0.0818543 -0.0251648 -0.0019986 0.0011802 0.0911636 0.085262 0.0040153 0.0249401 0.0361584 0.0385756 0.1200757 0.0050317 0.0927284 -0.1402104 0.1018904 -0.0768447 -0.0218306 -0.0616253 0.0179482 0.0053395 -0.0181329 0.0089053 0.1436052 -0.0252935 -0.1356543 -0.0120364 -0.0677258 -0.0212942 0.009463 -0.0181511 -0.0016098 0.1531292 0.063602 0.063712 -0.0207462 0.0462158 -0.1298783 0.0377437 -0.0206567 0.0407759 0.1501265 -0.0187941 -0.0658966 -0.0167459 -0.1356874 -0.0343673 0.0015542 -0.0063343 0.0112737 0.1529615 0.0584732 -0.2278777 0.0580007 -0.151438 0.1769603 -0.0303023 0.0148741 -0.0092792 0.14811 0.263678 0.0243916 0.1230967 0.0441089 0.0918796 -0.1193321 0.0216364 -0.0362609 0.1222684 0.0599512 0.057992 -0.0182028 0.0728747 -0.121868 0.0422096 -0.0221381 0.0448495 0.1473097 -0.1390466 0.0548321 -0.0461065 0.0548111 0.0775623 0.0171188 -0.0486729 0.0170269 0.151919 unknown
polarizability: 177.6684336|-9.6949239|157.0950122|16.9383598|-13.6952318|73.6766432 unknown
InChI: InChI=1S/C12H13N/c1-9(13)11-8-4-6-10-5-2-3-7-12(10)11/h2-9H,13H2,1H3
charge 0 multiplicity 1
26 atoms
N  -2.285902 -1.648239 0.942513
C  -1.087025 0.118769 -0.299856
C  -2.153524 -0.985789 -0.386979
C  0.296089 -0.23038 -0.037912
C  1.300869 0.816241 -0.009839
C  -1.4168 1.46626 -0.494049
C  -3.514595 -0.515596 -0.960625
C  0.720684 -1.585115 0.183269
C  0.907872 2.180526 -0.212356
C  -0.428412 2.498974 -0.444992
C  2.674474 0.470075 0.220072
C  2.066428 -1.891553 0.400109
C  3.055619 -0.857985 0.41604
H  -1.761989 -1.759012 -1.082508
H  -2.452827 1.75019 -0.701575
H  -4.00006 0.225164 -0.298138
H  -4.194846 -1.384062 -1.042214
H  -3.410656 -0.072905 -1.968996
H  -0.041065 -2.367674 0.23141
H  1.674163 2.964659 -0.184667
H  -0.730941 3.54046 -0.60068
H  3.42252 1.272115 0.238092
H  -3.018653 -2.367195 0.966769
H  -2.379637 -0.981867 1.717192
H  2.369176 -2.930918 0.570584
H  4.107239 -1.112743 0.589235
