program: Orca
programVersion: 5.0.2
elementType: Br Cl S P O O O C C C C C C C C C C C H H H H H H H H H H H H H H H
charge: 0
multiplicity: 1
keywords: wb97x-d3
keywords: def2-TZVPP
keywords: def2/J RIJCOSX
keywords: DEFGRID2
keywords: scfconv7
keywords: smallprint printgap noloewdin
keywords: NOSOSCF
formula: C11H15BrClO3PS
InChI: InChI=1/C11H15BrClO3PS/c1-3-7-18-17(14,15-4-2)16-11-6-5-9(12)8-10(11)13/h5-6,8H,3-4,7H2,1-2H3
33 atoms
Br 4.538297 1.531906 0.411068
Cl 0.575127 -1.419246 -2.016044
S  -3.77866 -1.323738 -0.173166
P  -2.245103 0.033734 -0.062865
O  -0.979435 -0.86981 0.423121
O  -2.611307 0.831982 1.261373
O  -1.951004 0.841635 -1.269191
C  -3.36549 -2.210259 -1.731457
C  -2.557525 -3.475119 -1.512118
C  -3.280883 -4.528759 -0.692111
C  0.270454 -0.299644 0.418909
C  -3.133849 2.182357 1.219563
C  1.110609 -0.488506 -0.67147
C  0.709556 0.435354 1.506872
C  -2.019122 3.196099 1.238932
C  2.387832 0.048943 -0.678512
C  1.981882 0.983241 1.513216
C  2.807085 0.788502 0.416412
H  -2.864199 -1.514873 -2.403901
H  -4.334506 -2.439843 -2.176237
H  -2.330599 -3.875254 -2.50436
H  -1.598278 -3.232585 -1.053308
H  -4.247894 -4.778636 -1.131821
H  -2.69458 -5.446153 -0.638598
H  -3.455734 -4.194929 0.33171
H  -3.775467 2.312832 0.346729
H  -3.76026 2.269515 2.105145
H  0.059241 0.570608 2.360692
H  -2.451765 4.196378 1.275425
H  -1.384256 3.074625 2.116613
H  -1.39822 3.133222 0.345636
H  3.03014 -0.111427 -1.533584
H  2.309518 1.553886 2.371036
elementType: Br Cl S P O C H
totalener: -4428.05482453 hartree
nucrepener: 2252.43333468 hartree
electener: -6680.48815921 hartree
twoeener: 3937.11152862 hartree
cpcmener: -0.02564615 hartree
kineticenergy: 4419.42822310 hartree
xcener: -190.169553135903 hartree
chargesum: -0.0000000
charge: -0.028959 -0.064215 -0.161403 0.829057 -0.356431 -0.366450 -0.623206 -0.097243 -0.095126 -0.259429 0.267357 0.050305 -0.002189 -0.208520 -0.255053 -0.065127 -0.078058 -0.063145 0.120265 0.133370 0.082997 0.046354 0.087769 0.093216 0.075216 0.101745 0.108510 0.164176 0.107609 0.088120 0.084931 0.132473 0.151085
qa: -0.0290 -0.0642 -0.1614 0.8291 -0.3564 -0.3665 -0.6232 -0.0972 -0.0951 -0.2594 0.2674 0.0503 -0.0022 -0.2085 -0.2551 -0.0651 -0.0781 -0.0631 0.1203 0.1334 0.0830 0.0464 0.0878 0.0932 0.0752 0.1017 0.1085 0.1642 0.1076 0.0881 0.0849 0.1325 0.1511
va: 1.2228 1.2492 2.3161 5.4941 2.0738 2.1022 1.9477 3.8479 3.8849 3.9427 3.7223 3.8379 4.0471 4.0240 3.9161 3.9052 3.8729 3.9953 1.0288 1.0033 1.0067 1.0354 1.0004 1.0045 1.0121 1.0018 0.9942 1.0003 1.0089 1.0026 1.0168 1.0067 0.9926
dispcorr: -0.017896271 hartree
energy: -4428.072720799532
dipole: -68.07904 67.35725 -0.72179 -20.21950 20.13396 -0.08555 -1.03288 2.01002 0.97714
magnitude: 1.21783 au
magnitude: 3.09548 debye
