program: Orca
programVersion: 5.0.2
elementType: Br Cl S P O O O C C C C C C C C C C C H H H H H H H H H H H H H H H
charge: 0
multiplicity: 1
keywords: wb97x-d3
keywords: def2-TZVPP
keywords: def2/J RIJCOSX
keywords: DEFGRID2
keywords: scfconv7
keywords: smallprint printgap noloewdin
keywords: NOSOSCF
formula: C11H15BrClO3PS
InChI: InChI=1/C11H15BrClO3PS/c1-3-7-18-17(14,15-4-2)16-11-6-5-9(12)8-10(11)13/h5-6,8H,3-4,7H2,1-2H3
33 atoms
Br 4.517721 0.593365 1.460241
Cl 0.337287 2.439588 -1.608299
S  -2.278014 -1.765264 0.625205
P  -2.13795 -0.244788 -0.760507
O  -0.668174 -0.31665 -1.446449
O  -1.993953 1.041703 0.150891
O  -3.160099 -0.257022 -1.828872
C  -2.732273 -3.171422 -0.466199
C  -4.230425 -3.319224 -0.651376
C  -4.554047 -4.519999 -1.526958
C  0.498034 -0.113621 -0.755743
C  -3.124048 1.619983 0.85182
C  1.086625 1.145884 -0.758147
C  1.123339 -1.163169 -0.105198
C  -2.832705 3.077743 1.086092
C  2.287586 1.363826 -0.102464
C  2.322925 -0.96022 0.557659
C  2.890786 0.304158 0.557539
H  -2.312931 -4.045216 0.033573
H  -2.209485 -3.071033 -1.417964
H  -4.706197 -3.432711 0.324576
H  -4.639597 -2.413318 -1.099335
H  -4.110869 -4.419567 -2.51895
H  -4.181704 -5.44673 -1.088262
H  -5.631294 -4.625333 -1.65571
H  -4.030797 1.493822 0.258363
H  -3.253297 1.086565 1.794125
H  0.680128 -2.149367 -0.125214
H  -1.929706 3.215427 1.680493
H  -2.721541 3.619071 0.147173
H  -3.664229 3.520154 1.634248
H  2.731044 2.350191 -0.116207
H  2.795902 -1.791675 1.061155
elementType: Br Cl S P O C H
totalener: -4428.05549743 hartree
nucrepener: 2228.19660616 hartree
electener: -6656.25210359 hartree
twoeener: 3912.42053718 hartree
cpcmener: -0.02791314 hartree
kineticenergy: 4419.42742929 hartree
xcener: -190.171086266371 hartree
chargesum: -0.0000000
charge: -0.028102 -0.064705 -0.179524 0.812178 -0.356806 -0.327861 -0.623559 -0.072942 -0.089306 -0.270993 0.249801 0.033577 -0.011352 -0.184632 -0.251653 -0.053443 -0.090843 -0.066500 0.132217 0.116822 0.065970 0.064721 0.085038 0.084462 0.093799 0.108225 0.104744 0.164632 0.091336 0.086292 0.097016 0.131437 0.149953
qa: -0.0281 -0.0647 -0.1795 0.8122 -0.3568 -0.3279 -0.6236 -0.0729 -0.0893 -0.2710 0.2498 0.0336 -0.0114 -0.1846 -0.2517 -0.0534 -0.0908 -0.0665 0.1322 0.1168 0.0660 0.0647 0.0850 0.0845 0.0938 0.1082 0.1047 0.1646 0.0913 0.0863 0.0970 0.1314 0.1500
va: 1.2236 1.2459 2.2874 5.5105 2.1130 2.1210 1.9841 3.8219 3.9119 3.9535 3.7980 3.8480 4.0020 4.0223 3.9638 3.8945 3.8967 3.9947 1.0042 1.0188 1.0125 1.0273 1.0010 1.0007 1.0039 0.9935 0.9919 0.9924 1.0020 1.0068 1.0084 1.0083 0.9943
dispcorr: -0.016511170 hartree
energy: -4428.072008604528
dipole: -75.50386 75.41162 -0.09224 -23.56641 22.49343 -1.07297 -11.73154 13.44198 1.71043
magnitude: 2.02123 au
magnitude: 5.13755 debye
