program: Orca
programVersion: 5.0.2
elementType: Br Cl S P O O O C C C C C C C C C C C H H H H H H H H H H H H H H H
charge: 0
multiplicity: 1
keywords: wb97x-d3
keywords: def2-TZVPP
keywords: def2/J RIJCOSX
keywords: DEFGRID2
keywords: scfconv7
keywords: smallprint printgap noloewdin
keywords: NOSOSCF
formula: C11H15BrClO3PS
InChI: InChI=1/C11H15BrClO3PS/c1-3-7-18-17(14,15-4-2)16-11-6-5-9(12)8-10(11)13/h5-6,8H,3-4,7H2,1-2H3
33 atoms
Br 4.724318 1.206658 -0.274799
Cl 0.787096 -2.426829 0.991673
S  -3.777928 -1.118788 0.13346
P  -2.307818 0.258115 -0.276987
O  -1.050081 -0.226015 0.632274
O  -2.752291 1.537143 0.553768
O  -1.974823 0.44678 -1.706834
C  -3.559309 -2.277029 -1.274187
C  -2.309297 -3.133151 -1.20664
C  -2.243054 -4.033184 0.013025
C  0.242535 0.144216 0.389211
C  -3.812012 2.407539 0.087051
C  1.228426 -0.825718 0.54097
C  0.608978 1.433936 0.037503
C  -3.588183 3.77471 0.673792
C  2.565485 -0.516302 0.351739
C  1.941153 1.755109 -0.164373
C  2.909599 0.776884 -0.007939
H  -3.610681 -1.700828 -2.196337
H  -4.45594 -2.89759 -1.230626
H  -2.307018 -3.743397 -2.113672
H  -1.417243 -2.506394 -1.267626
H  -1.357429 -4.667325 -0.02109
H  -2.19962 -3.458677 0.938343
H  -3.115508 -4.686895 0.065417
H  -3.8075 2.449139 -1.003071
H  -4.766198 1.989077 0.408694
H  -0.135413 2.213165 -0.059929
H  -3.607314 3.753656 1.76333
H  -2.638146 4.19692 0.346893
H  -4.383452 4.439614 0.33863
H  3.313932 -1.286363 0.480031
H  2.201326 2.768365 -0.43625
elementType: Br Cl S P O C H
totalener: -4428.05589853 hartree
nucrepener: 2230.11716667 hartree
electener: -6658.17306520 hartree
twoeener: 3914.63633683 hartree
cpcmener: -0.02487948 hartree
kineticenergy: 4419.42857493 hartree
xcener: -190.171903919333 hartree
chargesum: -0.0000000
charge: -0.030588 -0.064959 -0.165554 0.844005 -0.335197 -0.355602 -0.624308 -0.097352 -0.087834 -0.279278 0.216396 0.034452 0.026023 -0.158028 -0.248160 -0.069645 -0.115089 -0.055281 0.129220 0.128938 0.086001 0.048997 0.097724 0.067403 0.098536 0.104081 0.105334 0.147800 0.090405 0.089611 0.093218 0.129901 0.148831
qa: -0.0306 -0.0650 -0.1656 0.8440 -0.3352 -0.3556 -0.6243 -0.0974 -0.0878 -0.2793 0.2164 0.0345 0.0260 -0.1580 -0.2482 -0.0696 -0.1151 -0.0553 0.1292 0.1289 0.0860 0.0490 0.0977 0.0674 0.0985 0.1041 0.1053 0.1478 0.0904 0.0896 0.0932 0.1299 0.1488
va: 1.2218 1.2488 2.3091 5.4566 2.1197 2.1203 1.9569 3.8637 3.8605 3.9202 3.8273 3.8530 3.9620 3.9726 3.9625 3.9163 3.9139 3.9846 1.0228 1.0028 1.0099 1.0311 1.0025 1.0152 1.0057 0.9950 0.9945 1.0096 1.0029 1.0041 1.0064 1.0097 0.9953
dispcorr: -0.017442484 hartree
energy: -4428.073341013681
dipole: -73.23280 71.81335 -1.41945 -11.07290 11.48733 0.41443 -2.21444 2.36593 0.15149
magnitude: 1.48645 au
magnitude: 3.77826 debye
