program: Gaussian 09
title: 000066307
version: EM64L-G09RevD.01
frameworkgroup: C1[X(C6H13NO)]
method: RPBEPBE
basis: SDD
operation: Freq
keyword: #p
keyword: freq=noraman
keyword: PBEPBE/SDD
title: #p freq=noraman PBEPBE/SDD
converged: NO YES NO NO
title: Mulliken charges:
elementType: O N C C C C C C H H H H H H H H H H H H H
charge: -0.439981 -0.585276 0.313223 -0.485604 -0.515190 -0.420915 -0.396754 -0.431400 0.184290 0.219911 0.213256 0.206720 0.203995 0.235751 0.217880 0.204292 0.186505 0.221399 0.272334 0.253284 0.342279
chargesum: 0.00000
title: Mulliken charges with hydrogens summed into heavy atoms:
elementType: O N C C C C C C
charge: -0.097701 -0.059659 0.313223 -0.081402 -0.095214 0.018831 0.025417 -0.023497
polarizability: 7.83849656e+01 7.91773955e-01 7.21723007e+01 5.78244262e-01 -1.93726512e-01 6.68856024e+01
1716.lowfreq: -24.1910 -5.8133 0.0004 0.0005 0.0008 15.3912 47.3822 117.7449 182.6147
frequency: 47.2473 117.7124 182.5924 211.1907 265.0628 308.9203 338.9358 375.3609 403.4836 440.3025 592.7684 639.7160 725.2857 748.3847 777.2523 834.5924 887.3691 901.4970 922.0177 951.4418 970.1362 1014.9006 1028.7348 1046.1682 1058.4275 1094.8248 1157.0679 1177.1351 1196.3983 1225.3248 1264.7693 1268.3524 1289.6969 1303.6259 1316.4499 1320.4186 1332.8795 1371.5898 1451.9422 1455.8873 1460.3890 1467.0031 1486.2562 1642.3781 2946.0137 2968.8792 2983.9960 3005.4190 3021.3591 3035.4663 3040.5174 3062.2141 3065.7766 3093.2793 3409.0602 3533.1577 3555.0350
redmass: 1.8925 3.3269 2.7880 2.2678 1.1133 1.7101 1.6253 2.2921 1.9402 2.8364 2.1355 2.7452 2.0799 1.5837 1.5991 1.9272 2.5106 2.0707 1.7881 2.2490 3.0667 1.4213 2.0418 1.5048 2.5454 1.5202 1.2685 1.3986 1.7727 1.2986 1.4659 1.3903 1.4037 1.5563 1.5034 1.4091 1.4748 1.2692 1.0842 1.0813 1.0933 1.0830 1.0966 1.0941 1.0667 1.0604 1.0603 1.0614 1.0663 1.1003 1.0999 1.0977 1.1025 1.1038 1.0447 1.0955 1.0659
irintensity: 0.1284 2.8063 4.5808 1.7321 67.7168 83.7265 38.7644 13.7509 18.2353 0.9691 1.9983 8.7326 170.2403 42.9629 1.1815 6.4401 4.6277 39.6313 0.1027 9.5265 50.4681 3.1670 7.5967 11.7768 0.5835 12.6256 11.0961 8.0485 3.3296 2.6448 1.0345 1.6224 9.0750 5.7540 10.7394 3.2463 11.0766 14.2912 2.2703 4.9968 8.6864 7.9308 7.8827 39.3128 54.7345 44.7395 43.5356 55.1270 58.3743 15.8137 28.0216 20.9620 32.2400 64.6844 1.7374 2.1757 4.8111
temp: 298.150 k
press: 1.00000 atm
elementType: 8 7 6 6 6 6 6 6 1 1 1 1 1 1 1 1 1 1 1 1 1
symmnumber: 1
zpe: 489225.2 jmol-1
zpe.correction: 0.186336 hartree
zpe.thermalcorrener: 0.195246 hartree
zpe.thermalcorrenthalpy: 0.196191 hartree
zpe.thermalcorrgfe: 0.152901 hartree
zpe.sumelectzpe: -365.726600 hartree
zpe.sumelectthermal: -365.717690 hartree
zpe.sumelectthermalent: -365.716746 hartree
zpe.sumelectthermalfe: -365.760035 hartree
dipole: -0.7388 -0.1469 -1.1152
dipole: 1.3457
quadrupole: -58.1137 -45.8699 -49.6437
quadrupole: 1.7401 0.8314 -2.1457
quadrupole: -6.9046 5.3392 1.5654 1.7401 0.8314 -2.1457
hfenergy: -365.9129362 hartree
pointgroup: C01 [X(C6H13N1O1)]
dipole: -0.2955547 0.0382125 0.4376106 debye
dipolederiv: -0.7767209 0.2591638 -0.1039294 0.3235061 -0.3714442 -0.1382066 -0.1079272 -0.1216855 -0.4742203 -0.5083869 -0.0645435 -0.1549642 -0.106504 -0.2434928 -0.0464261 -0.1354472 0.0006703 -0.7189611 0.1884315 0.0830779 -0.0469432 0.0478439 0.157859 -0.0929817 -0.0352168 -0.0813236 0.4504824 -0.0897572 -0.0340358 -0.0506682 -0.0495362 -0.0385084 0.0537037 -0.0463923 -0.0264597 0.1240536 -0.0639914 0.0283676 0.0308116 0.0078211 0.0470167 -0.0762733 0.0112852 0.00795 0.1144057 0.0465301 0.0268563 -0.0612332 0.0029601 0.0657555 -0.0438322 0.0225421 0.0082479 0.1133701 0.0594413 -0.0123442 -0.0248305 0.0260129 0.0076446 -0.0436928 -0.0487361 -0.043674 0.1462949 0.4677382 -0.1679676 -0.0706457 -0.2240514 0.3763829 0.0506723 0.0264561 0.0616598 0.2384977 0.0389293 -0.0062743 -0.0245367 -0.00119 0.0501718 0.0279865 -0.0469501 0.0785029 -0.1927662 -0.0152761 0.1224846 0.0532105 0.106683 -0.0856295 -0.055801 0.0644124 -0.0895769 0.0320238 0.0367459 -0.0328707 0.0176304 -0.0299399 -0.151285 0.0720252 0.0080702 0.1227955 0.0276286 0.0363853 -0.0356851 -0.0495812 -0.020917 0.0576084 -0.019179 -0.0393207 -0.0800669 -0.1638015 -0.0707345 -0.1253444 0.045985 -0.1280807 -0.0862681 0.0461298 0.0717883 0.076723 0.0491418 0.0803771 0.0296277 -0.007912 0.0354665 0.0552292 -0.0152358 -0.0574186 -0.0608134 -0.1235791 -0.0442435 0.0568869 -0.0767027 0.0845964 -0.0020641 0.0627559 -0.1250973 0.0803947 -0.027453 -0.0469409 0.0120434 0.0984605 -0.0141708 0.0495674 -0.0082611 0.1561792 -0.0323639 -0.1059276 -0.0072393 0.0441773 0.0425282 0.0444438 0.0370332 0.0394812 0.0267253 -0.0234557 -0.2507784 -0.0028114 -0.0593902 0.0149408 -0.0583773 -0.1314013 0.0036918 0.0282744 0.0503361 0.0714729 0.1114585 0.0984589 0.1614721 0.0955239 0.171288 0.0391457 0.0658823 0.0288162 0.2241313 0.2311345 -0.0789699 0.1032235 -0.040199 -0.0334786 0.0805396 0.0454136 -0.0155838 0.1892551 0.3289304 -0.1437188 0.1036845 -0.1018917 0.0680155 0.0637579 0.1154773 0.0589069 0.2767292 unknown
polarizability: 78.3640782|-0.8893756|72.2117898|-0.4734977|0.1177603|66.8670007 unknown
InChI: InChI=1S/C6H13NO/c7-6(5-8)3-1-2-4-6/h8H,1-5,7H2
charge 0 multiplicity 1
21 atoms
O  2.708351 -0.487139 0.174748
N  0.446004 0.352667 -1.517424
C  0.312081 0.208296 -0.044006
C  -0.308428 -1.189149 0.257833
C  -0.788962 1.174748 0.473423
C  -1.785515 -1.016501 -0.170167
C  -2.153847 0.441853 0.251922
C  1.665619 0.426557 0.681958
H  -0.232551 -1.400324 1.345028
H  0.191761 -2.009172 -0.2916
H  -0.743123 2.153146 -0.040925
H  -0.625243 1.371757 1.551034
H  -2.451888 -1.777281 0.274827
H  -1.838475 -1.103124 -1.267929
H  -2.755195 0.93383 -0.531766
H  -2.756403 0.457473 1.178825
H  1.547604 0.312449 1.781836
H  2.060982 1.434992 0.467003
H  1.252578 -0.182077 -1.868315
H  0.508611 1.334775 -1.814597
H  2.461539 -1.413075 0.428091
