program: Orca
programVersion: 5.0.2
elementType: Br Cl S P O O O C C C C C C C C C C C H H H H H H H H H H H H H H H
charge: 0
multiplicity: 1
keywords: wb97x-d3
keywords: def2-TZVPP
keywords: def2/J RIJCOSX
keywords: DEFGRID2
keywords: scfconv7
keywords: smallprint printgap noloewdin
keywords: NOSOSCF
formula: C11H15BrClO3PS
InChI: InChI=1/C11H15BrClO3PS/c1-3-7-18-17(14,15-4-2)16-11-6-5-9(12)8-10(11)13/h5-6,8H,3-4,7H2,1-2H3
33 atoms
Br 4.482519 -0.736056 -0.234871
Cl 0.253673 2.770675 -0.583362
S  -3.074815 -1.436038 0.975707
P  -2.403985 0.362534 0.215832
O  -1.150394 0.843265 1.150001
O  -3.522328 1.343661 0.750002
O  -2.063439 0.33609 -1.224682
C  -2.756919 -2.560205 -0.437058
C  -1.310812 -2.995928 -0.569653
C  -1.133209 -3.943615 -1.746625
C  0.127632 0.475631 0.8297
C  -3.445936 2.789127 0.632757
C  0.902993 1.292201 0.01452
C  0.666261 -0.691804 1.342384
C  -3.751266 3.26338 -0.765564
C  2.20563 0.941648 -0.300551
C  1.965987 -1.058574 1.034697
C  2.720676 -0.241052 0.207839
H  -3.132314 -2.094128 -1.346882
H  -3.400306 -3.416081 -0.225463
H  -0.668929 -2.123739 -0.70618
H  -0.991629 -3.480402 0.355437
H  -0.099513 -4.28208 -1.818003
H  -1.764727 -4.828075 -1.649382
H  -1.386713 -3.454789 -2.688557
H  -4.189154 3.155912 1.337277
H  -2.469108 3.13722 0.970149
H  0.066445 -1.318651 1.988968
H  -4.707295 2.876122 -1.11728
H  -3.815432 4.351623 -0.757829
H  -2.975987 2.983514 -1.477653
H  2.79515 1.588788 -0.935615
H  2.367804 -1.976619 1.44031
elementType: Br Cl S P O C H
totalener: -4428.05489307 hartree
nucrepener: 2270.11435039 hartree
electener: -6698.16924346 hartree
twoeener: 3954.67396998 hartree
cpcmener: -0.02450255 hartree
kineticenergy: 4419.42823013 hartree
xcener: -190.171236552560 hartree
chargesum: -0.0000000
charge: -0.028608 -0.063373 -0.167199 0.823912 -0.364622 -0.349083 -0.618015 -0.067942 -0.100323 -0.264677 0.273576 0.021647 0.005475 -0.212963 -0.235407 -0.069169 -0.073876 -0.061769 0.110870 0.133430 0.053309 0.073728 0.093408 0.086146 0.085995 0.114226 0.101939 0.151964 0.094546 0.099499 0.072507 0.130414 0.150436
qa: -0.0286 -0.0634 -0.1672 0.8239 -0.3646 -0.3491 -0.6180 -0.0679 -0.1003 -0.2647 0.2736 0.0216 0.0055 -0.2130 -0.2354 -0.0692 -0.0739 -0.0618 0.1109 0.1334 0.0533 0.0737 0.0934 0.0861 0.0860 0.1142 0.1019 0.1520 0.0945 0.0995 0.0725 0.1304 0.1504
va: 1.2236 1.2494 2.3004 5.4648 2.0739 2.1430 1.9534 3.8294 3.9061 3.9571 3.7001 3.8599 4.0329 4.0001 3.9007 3.9125 3.8652 3.9956 1.0273 1.0047 1.0186 1.0098 1.0036 1.0013 1.0008 0.9924 1.0074 1.0034 1.0054 1.0069 1.0226 1.0084 0.9924
dispcorr: -0.018353360 hartree
energy: -4428.073246429277
dipole: -62.79839 62.48193 -0.31646 -5.48415 4.97638 -0.50777 -3.50624 4.37004 0.86379
magnitude: 1.05077 au
magnitude: 2.67085 debye
