program: Orca
programVersion: 5.0.2
elementType: Br Cl S P O O O C C C C C C C C C C C H H H H H H H H H H H H H H H
charge: 0
multiplicity: 1
keywords: wb97x-d3
keywords: def2-TZVPP
keywords: def2/J RIJCOSX
keywords: DEFGRID2
keywords: scfconv7
keywords: smallprint printgap noloewdin
keywords: NOSOSCF
formula: C11H15BrClO3PS
InChI: InChI=1/C11H15BrClO3PS/c1-3-7-18-17(14,15-4-2)16-11-6-5-9(12)8-10(11)13/h5-6,8H,3-4,7H2,1-2H3
33 atoms
Br 4.590233 -0.055239 0.960722
Cl 0.600751 1.280439 -2.596082
S  -1.427588 -1.520952 -0.835084
P  -2.35225 0.232984 -0.258221
O  -1.136102 1.312737 -0.264865
O  -2.710796 -0.001562 1.275857
O  -3.465557 0.725617 -1.100331
C  -2.897676 -2.435827 -1.450397
C  -3.847352 -2.906927 -0.365383
C  -4.967264 -3.74974 -0.958063
C  0.157502 0.980818 0.04223
C  -3.72296 0.792908 1.94587
C  1.095083 0.941773 -0.984351
C  0.549896 0.715722 1.343299
C  -3.325202 2.238641 2.107151
C  2.420785 0.640756 -0.717838
C  1.871031 0.407305 1.623493
C  2.793584 0.368461 0.589526
H  -2.457902 -3.286092 -1.974598
H  -3.399806 -1.821159 -2.196619
H  -3.294385 -3.485176 0.37705
H  -4.27965 -2.05163 0.157533
H  -5.647768 -4.091126 -0.178005
H  -5.552965 -3.180592 -1.681383
H  -4.577238 -4.632657 -1.466625
H  -4.665591 0.69783 1.405982
H  -3.842341 0.313212 2.9149
H  -0.17095 0.759216 2.148662
H  -2.365023 2.338537 2.613212
H  -3.278451 2.7664 1.154323
H  -4.077285 2.738131 2.718376
H  3.1359 0.615878 -1.528832
H  2.158928 0.202651 2.645229
elementType: Br Cl S P O C H
totalener: -4428.05340956 hartree
nucrepener: 2245.06161552 hartree
electener: -6673.11502508 hartree
twoeener: 3929.37850167 hartree
cpcmener: -0.02869145 hartree
kineticenergy: 4419.41218885 hartree
xcener: -190.167966246513 hartree
chargesum: -0.0000000
charge: -0.026517 -0.057446 -0.174616 0.823929 -0.355221 -0.347789 -0.632687 -0.079106 -0.081046 -0.272906 0.152772 0.042762 0.020983 -0.128054 -0.258993 -0.062903 -0.104258 -0.049922 0.131046 0.118408 0.067686 0.060645 0.094134 0.085584 0.086446 0.105444 0.112854 0.157722 0.094770 0.090085 0.105288 0.130507 0.150395
qa: -0.0265 -0.0574 -0.1746 0.8239 -0.3552 -0.3478 -0.6327 -0.0791 -0.0810 -0.2729 0.1528 0.0428 0.0210 -0.1281 -0.2590 -0.0629 -0.1043 -0.0499 0.1310 0.1184 0.0677 0.0606 0.0941 0.0856 0.0864 0.1054 0.1129 0.1577 0.0948 0.0901 0.1053 0.1305 0.1504
va: 1.2246 1.2557 2.2964 5.4555 2.0981 2.0566 1.9701 3.8676 3.8894 3.9601 3.8090 3.8183 3.9832 3.9838 3.9283 3.9254 3.9186 3.9779 1.0010 1.0245 1.0149 1.0213 1.0033 1.0007 1.0008 1.0039 0.9916 1.0049 1.0013 1.0128 1.0089 1.0098 0.9941
dispcorr: -0.017272534 hartree
energy: -4428.070682089177
dipole: -81.02983 80.66456 -0.36527 -12.67778 11.64714 -1.03063 1.52983 0.34623 1.87606
magnitude: 2.17146 au
magnitude: 5.51941 debye
