program: Orca
programVersion: 5.0.2
elementType: Br Cl S P O O O C C C C C C C C C C C H H H H H H H H H H H H H H H
charge: 0
multiplicity: 1
keywords: wb97x-d3
keywords: def2-TZVPP
keywords: def2/J RIJCOSX
keywords: DEFGRID2
keywords: scfconv7
keywords: smallprint printgap noloewdin
keywords: NOSOSCF
formula: C11H15BrClO3PS
InChI: InChI=1/C11H15BrClO3PS/c1-3-7-18-17(14,15-4-2)16-11-6-5-9(12)8-10(11)13/h5-6,8H,3-4,7H2,1-2H3
33 atoms
Br 4.443576 -1.293687 -0.010127
Cl 0.702425 2.514231 -1.359419
S  -2.596527 -0.937522 1.103038
P  -2.209512 0.866909 0.160543
O  -0.856978 1.404828 0.886776
O  -3.152887 1.97216 0.798692
O  -2.181685 0.784905 -1.317406
C  -3.071419 -2.048122 -0.281696
C  -1.958808 -2.985978 -0.711509
C  -0.764673 -2.315248 -1.366428
C  0.350613 0.786654 0.683652
C  -4.442837 2.291232 0.222602
C  1.177777 1.201394 -0.353443
C  0.769944 -0.219963 1.53671
C  -5.464117 1.196047 0.407041
C  2.403301 0.58863 -0.5641
C  1.992761 -0.839345 1.340827
C  2.79265 -0.437685 0.282282
H  -3.439902 -1.445322 -1.109753
H  -3.917986 -2.611858 0.10925
H  -1.632945 -3.579515 0.145577
H  -2.409619 -3.691681 -1.4151
H  -1.058652 -1.738561 -2.243851
H  -0.245042 -1.645003 -0.680707
H  -0.041974 -3.063825 -1.691562
H  -4.751569 3.196247 0.741648
H  -4.314858 2.536904 -0.832377
H  0.142088 -0.522654 2.363214
H  -5.563421 0.907877 1.452982
H  -6.431548 1.569784 0.070236
H  -5.236494 0.306471 -0.181558
H  3.030789 0.919595 -1.380485
H  2.299471 -1.628328 2.013169
elementType: Br Cl S P O C H
totalener: -4428.05206805 hartree
nucrepener: 2283.99035749 hartree
electener: -6712.04242555 hartree
twoeener: 3968.87497848 hartree
cpcmener: -0.02645314 hartree
kineticenergy: 4419.42216034 hartree
xcener: -190.172643192772 hartree
chargesum: -0.0000000
charge: -0.025904 -0.059757 -0.181459 0.830133 -0.356880 -0.355081 -0.613843 -0.081049 -0.084171 -0.233705 0.222821 0.043330 0.006018 -0.162600 -0.260345 -0.071434 -0.087870 -0.058740 0.109274 0.134409 0.068061 0.076545 0.087753 0.020388 0.100142 0.111489 0.102249 0.152984 0.092242 0.104692 0.089269 0.130345 0.150694
qa: -0.0259 -0.0598 -0.1815 0.8301 -0.3569 -0.3551 -0.6138 -0.0810 -0.0842 -0.2337 0.2228 0.0433 0.0060 -0.1626 -0.2603 -0.0714 -0.0879 -0.0587 0.1093 0.1344 0.0681 0.0765 0.0878 0.0204 0.1001 0.1115 0.1022 0.1530 0.0922 0.1047 0.0893 0.1303 0.1507
va: 1.2249 1.2524 2.2815 5.4905 2.1269 2.1185 1.9591 3.8522 3.9092 3.9323 3.7905 3.8434 4.0007 3.9673 3.9044 3.9226 3.8638 3.9836 1.0285 1.0040 1.0111 1.0090 1.0102 1.0167 1.0100 0.9903 1.0038 0.9985 1.0063 1.0095 1.0027 1.0097 0.9931
dispcorr: -0.019017127 hartree
energy: -4428.071085179822
dipole: -71.88214 70.43080 -1.45134 -1.92541 0.67848 -1.24693 -0.78874 1.67709 0.88834
magnitude: 2.10959 au
magnitude: 5.36215 debye
