program: Orca
programVersion: 5.0.2
elementType: Br Cl S P O O O C C C C C C C C C C C H H H H H H H H H H H H H H H
charge: 0
multiplicity: 1
keywords: wb97x-d3
keywords: def2-TZVPP
keywords: def2/J RIJCOSX
keywords: DEFGRID2
keywords: scfconv7
keywords: smallprint printgap noloewdin
keywords: NOSOSCF
formula: C11H15BrClO3PS
InChI: InChI=1/C11H15BrClO3PS/c1-3-7-18-17(14,15-4-2)16-11-6-5-9(12)8-10(11)13/h5-6,8H,3-4,7H2,1-2H3
33 atoms
Br 4.84844 0.409063 -0.502807
Cl 0.331659 -0.035756 2.619712
S  -1.798565 -1.774738 0.437537
P  -2.175758 0.056564 -0.425072
O  -1.078558 1.013763 0.304674
O  -3.506273 0.586338 0.256495
O  -2.140412 0.087554 -1.906265
C  -2.593865 -2.869057 -0.804532
C  -4.105704 -2.75998 -0.882379
C  -4.81655 -3.031039 0.431447
C  0.264281 0.861737 0.083613
C  -4.328323 1.606432 -0.367712
C  1.05926 0.382319 1.117845
C  0.844014 1.213548 -1.123371
C  -3.687142 2.970799 -0.332312
C  2.42842 0.249341 0.954492
C  2.211352 1.082485 -1.30343
C  2.990293 0.597542 -0.264057
H  -2.296531 -3.867679 -0.480382
H  -2.124225 -2.688279 -1.769774
H  -4.394347 -1.78274 -1.276241
H  -4.426976 -3.488375 -1.631667
H  -4.537255 -4.004252 0.838512
H  -4.580173 -2.276267 1.181844
H  -5.897602 -3.027895 0.293327
H  -4.564809 1.303444 -1.388194
H  -5.251889 1.59621 0.2068
H  0.232823 1.610036 -1.922605
H  -2.79834 3.028155 -0.961092
H  -4.402413 3.700906 -0.711723
H  -3.419777 3.262686 0.682933
H  3.029485 -0.126137 1.771443
H  2.648419 1.363812 -2.251379
elementType: Br Cl S P O C H
totalener: -4428.05527204 hartree
nucrepener: 2245.57150611 hartree
electener: -6673.62677815 hartree
twoeener: 3930.37503280 hartree
cpcmener: -0.02419803 hartree
kineticenergy: 4419.43358865 hartree
xcener: -190.172603108963 hartree
chargesum: 0.0000000
charge: -0.027913 -0.061601 -0.177478 0.853156 -0.364606 -0.352878 -0.628728 -0.099883 -0.097467 -0.259527 0.244408 0.046438 -0.038137 -0.178042 -0.248493 -0.043024 -0.083383 -0.074018 0.130491 0.126864 0.061805 0.085970 0.088356 0.071696 0.095284 0.101206 0.111488 0.157470 0.086361 0.100232 0.090648 0.131906 0.151400
qa: -0.0279 -0.0616 -0.1775 0.8532 -0.3646 -0.3529 -0.6287 -0.0999 -0.0975 -0.2595 0.2444 0.0464 -0.0381 -0.1780 -0.2485 -0.0430 -0.0834 -0.0740 0.1305 0.1269 0.0618 0.0860 0.0884 0.0717 0.0953 0.1012 0.1115 0.1575 0.0864 0.1002 0.0906 0.1319 0.1514
va: 1.2238 1.2508 2.3180 5.4469 2.1111 2.0871 1.9489 3.8812 3.8748 3.9345 3.7781 3.8372 4.0256 4.0283 3.9195 3.8923 3.8783 3.9939 1.0014 1.0249 1.0208 1.0083 1.0006 1.0143 1.0052 1.0035 0.9899 1.0076 1.0120 1.0085 1.0057 1.0073 0.9930
dispcorr: -0.017031486 hartree
energy: -4428.072303522124
dipole: -83.74926 82.57867 -1.17059 -8.79731 8.76689 -0.03042 -5.42323 5.18132 -0.24192
magnitude: 1.19571 au
magnitude: 3.03925 debye
