program: Orca
programVersion: 5.0.2
elementType: Br Cl S P O O O C C C C C C C C C C C H H H H H H H H H H H H H H H
charge: 0
multiplicity: 1
keywords: wb97x-d3
keywords: def2-TZVPP
keywords: def2/J RIJCOSX
keywords: DEFGRID2
keywords: scfconv7
keywords: smallprint printgap noloewdin
keywords: NOSOSCF
formula: C11H15BrClO3PS
InChI: InChI=1/C11H15BrClO3PS/c1-3-7-18-17(14,15-4-2)16-11-6-5-9(12)8-10(11)13/h5-6,8H,3-4,7H2,1-2H3
33 atoms
Br 4.555457 0.182071 1.207838
Cl 0.627023 -0.598512 -2.570357
S  -1.841118 -1.313511 0.219817
P  -2.310933 0.598006 -0.396197
O  -0.944555 1.264878 -0.973858
O  -2.476593 1.392451 0.966959
O  -3.385294 0.732792 -1.404806
C  -2.204382 -2.316185 -1.280691
C  -3.398014 -3.228999 -1.06884
C  -4.714343 -2.506308 -0.849294
C  0.296606 1.024161 -0.447659
C  -3.762019 1.62462 1.596063
C  1.153791 0.159315 -1.118226
C  0.723711 1.649141 0.711521
C  -4.223011 0.445067 2.412987
C  2.428108 -0.089984 -0.636549
C  1.99499 1.408534 1.208139
C  2.83249 0.534296 0.533335
H  -1.30089 -2.892465 -1.471772
H  -2.357086 -1.65273 -2.130485
H  -3.466789 -3.856261 -1.961879
H  -3.196439 -3.907961 -0.237137
H  -4.706939 -1.92254 0.071874
H  -4.940262 -1.828429 -1.673487
H  -5.534322 -3.220353 -0.774614
H  -3.601355 2.495974 2.227541
H  -4.494679 1.892962 0.834436
H  0.070708 2.338793 1.228493
H  -5.123888 0.731882 2.956061
H  -4.471289 -0.41663 1.79364
H  -3.472391 0.145829 3.144254
H  3.07972 -0.767313 -1.17115
H  2.309886 1.905871 2.114932
elementType: Br Cl S P O C H
totalener: -4428.05332750 hartree
nucrepener: 2264.96348744 hartree
electener: -6693.01681494 hartree
twoeener: 3949.26311468 hartree
cpcmener: -0.02639321 hartree
kineticenergy: 4419.42408747 hartree
xcener: -190.173506049409 hartree
chargesum: 0.0000000
charge: -0.028294 -0.063228 -0.174856 0.839965 -0.354536 -0.343352 -0.631800 -0.088131 -0.082310 -0.267988 0.158611 0.043899 0.030105 -0.124383 -0.255663 -0.070420 -0.105525 -0.051822 0.124169 0.106683 0.076324 0.070626 0.072212 0.082195 0.099789 0.109605 0.101503 0.160968 0.104112 0.085819 0.092898 0.131945 0.150881
qa: -0.0283 -0.0632 -0.1749 0.8400 -0.3545 -0.3434 -0.6318 -0.0881 -0.0823 -0.2680 0.1586 0.0439 0.0301 -0.1244 -0.2557 -0.0704 -0.1055 -0.0518 0.1242 0.1067 0.0763 0.0706 0.0722 0.0822 0.0998 0.1096 0.1015 0.1610 0.1041 0.0858 0.0929 0.1319 0.1509
va: 1.2230 1.2512 2.2777 5.4845 2.1230 2.1198 1.9705 3.8697 3.9093 3.9448 3.8432 3.8441 3.9611 3.9869 3.9188 3.9343 3.8991 3.9848 1.0096 1.0271 1.0089 1.0112 0.9935 1.0070 1.0092 0.9894 1.0042 1.0032 1.0112 0.9920 1.0035 1.0094 0.9931
dispcorr: -0.018222777 hartree
energy: -4428.071550274956
dipole: -79.77056 79.60247 -0.16810 -11.59145 10.98386 -0.60759 -2.76115 4.39768 1.63654
magnitude: 1.75376 au
magnitude: 4.45771 debye
