program: Orca
programVersion: 5.0.2
elementType: Br Cl S P O O O C C C C C C C C C C C H H H H H H H H H H H H H H H
charge: 0
multiplicity: 1
keywords: wb97x-d3
keywords: def2-TZVPP
keywords: def2/J RIJCOSX
keywords: DEFGRID2
keywords: scfconv7
keywords: smallprint printgap noloewdin
keywords: NOSOSCF
formula: C11H15BrClO3PS
InChI: InChI=1/C11H15BrClO3PS/c1-3-7-18-17(14,15-4-2)16-11-6-5-9(12)8-10(11)13/h5-6,8H,3-4,7H2,1-2H3
33 atoms
Br 4.488273 -0.697782 0.058766
Cl 0.256569 2.694329 -0.88319
S  -2.796137 -1.556558 0.785162
P  -2.429103 0.304614 -0.026863
O  -1.244853 0.909083 0.922261
O  -3.662844 1.162838 0.472324
O  -2.115425 0.335234 -1.473914
C  -3.093505 -2.605306 -0.696905
C  -1.907177 -3.483026 -1.050139
C  -0.688467 -2.742779 -1.568152
C  0.059569 0.536674 0.725682
C  -3.913729 2.523091 0.0250
C  0.877343 1.286318 -0.111582
C  0.581183 -0.560821 1.389815
C  -3.257133 3.543175 0.919021
C  2.201319 0.927456 -0.310281
C  1.902068 -0.932778 1.201455
C  2.69671 -0.191633 0.340939
H  -3.397514 -1.972623 -1.528837
H  -3.953422 -3.214873 -0.422463
H  -1.637963 -4.093135 -0.185678
H  -2.260693 -4.180576 -1.814068
H  -0.923028 -2.158043 -2.457445
H  -0.27085 -2.068209 -0.820561
H  0.097079 -3.449243 -1.836949
H  -3.594342 2.634918 -1.011788
H  -4.996814 2.623428 0.053888
H  -0.044489 -1.131184 2.062423
H  -2.171768 3.536401 0.8310
H  -3.605131 4.533576 0.625128
H  -3.527906 3.393159 1.963659
H  2.822621 1.521001 -0.96687
H  2.287303 -1.796772 1.724845
elementType: Br Cl S P O C H
totalener: -4428.05282349 hartree
nucrepener: 2280.85535168 hartree
electener: -6708.90817517 hartree
twoeener: 3965.73220006 hartree
cpcmener: -0.02484731 hartree
kineticenergy: 4419.42168034 hartree
xcener: -190.170150974546 hartree
chargesum: -0.0000000
charge: -0.027554 -0.062234 -0.174506 0.837403 -0.362689 -0.357646 -0.619359 -0.077638 -0.085165 -0.247651 0.257128 0.042879 0.007215 -0.188481 -0.239863 -0.074940 -0.084727 -0.057510 0.108431 0.130782 0.067730 0.076167 0.087141 0.040471 0.099173 0.094849 0.111910 0.156250 0.070080 0.099531 0.091971 0.130168 0.150686
qa: -0.0276 -0.0622 -0.1745 0.8374 -0.3627 -0.3576 -0.6194 -0.0776 -0.0852 -0.2477 0.2571 0.0429 0.0072 -0.1885 -0.2399 -0.0749 -0.0847 -0.0575 0.1084 0.1308 0.0677 0.0762 0.0871 0.0405 0.0992 0.0948 0.1119 0.1563 0.0701 0.0995 0.0920 0.1302 0.1507
va: 1.2239 1.2500 2.2863 5.4821 2.0872 2.1336 1.9568 3.8510 3.8935 3.9358 3.7084 3.8622 4.0379 3.9847 3.9266 3.9232 3.8662 3.9909 1.0307 1.0081 1.0108 1.0092 1.0089 1.0119 1.0098 1.0040 0.9898 1.0017 1.0230 1.0076 1.0064 1.0089 0.9931
dispcorr: -0.018802040 hartree
energy: -4428.071625534516
dipole: -63.56330 62.78901 -0.77429 -2.87041 2.25129 -0.61912 -2.93073 3.67746 0.74673
magnitude: 1.24115 au
magnitude: 3.15474 debye
