program: Gaussian 09
title: 000066342
version: EM64L-G09RevD.01
frameworkgroup: C1[X(C18H16N2O2)]
method: RPBEPBE
basis: SDD
operation: Freq
keyword: #p
keyword: freq=noraman
keyword: PBEPBE/SDD
title: #p freq=noraman PBEPBE/SDD
converged: YES YES NO NO
title: Mulliken charges:
elementType: O O N N C C C C C C C C C C C C C C C C C C H H H H H H H H H H H H H H H H
charge: -0.307430 -0.309442 -0.722792 -0.741437 0.328515 0.367286 -0.504026 0.358587 0.373917 -0.412238 -0.418698 -0.163378 -0.523766 -0.525169 0.487020 0.503938 -0.423406 -0.443113 -0.436910 -0.444036 -0.160484 -0.161458 0.328765 0.258594 0.258716 0.229448 0.266744 0.251828 0.259978 0.254688 0.224319 0.215129 0.226077 0.220087 0.308171 0.303223 0.289686 0.383066
chargesum: 0.00000
title: Mulliken charges with hydrogens summed into heavy atoms:
elementType: O O N N C C C C C C C C C C C C C C C C C C
charge: -0.307430 -0.309442 -0.111398 -0.068685 0.328515 0.367286 -0.175261 0.358587 0.373917 -0.153644 -0.159982 0.066070 -0.257022 -0.273341 0.487020 0.503938 -0.163429 -0.188426 -0.212591 -0.228907 0.065593 0.058629
polarizability: 2.34902540e+02 -1.88045461e+00 2.78025794e+02 -3.12444128e+00 7.79286317e+00 1.45276763e+02
1716.lowfreq: -7.3828 -0.0001 0.0005 0.0007 3.4622 7.0238 31.2708 38.6810 51.4209
frequency: 31.2034 38.6545 51.4131 60.0417 86.2506 98.0221 174.9153 211.8292 216.3481 231.2505 234.7659 241.3959 288.2302 295.5613 306.4901 338.8864 379.7667 400.9036 406.3194 440.2422 447.5698 451.7385 455.4091 521.8838 522.6122 540.9019 558.7228 563.0928 569.1928 583.2019 602.3623 624.4164 646.0458 678.2729 683.2683 686.4647 696.7216 700.2266 734.2017 775.2248 781.0657 781.5624 789.2952 841.4885 853.3973 863.4165 866.6192 881.3817 913.2599 919.9674 947.0923 955.7131 962.0061 964.1227 966.7189 979.7490 982.7032 986.1338 1054.7171 1056.3164 1069.8306 1098.4489 1099.8211 1121.2026 1139.8593 1150.0890 1164.0996 1171.1662 1173.7371 1238.2033 1283.8297 1290.5975 1296.7250 1310.0584 1327.9181 1385.1353 1395.2988 1399.2443 1425.4405 1453.7569 1457.9352 1467.1244 1487.7934 1494.1743 1585.5537 1590.3523 1605.1913 1613.9262 1618.4486 1626.9494 1646.3869 1675.2387 3121.6538 3126.1249 3143.3408 3143.4344 3145.7634 3150.6883 3160.8643 3171.9666 3179.8890 3180.4998 3180.9642 3182.4441 3406.0275 3500.1221 3630.2645 3642.2562
redmass: 4.8167 5.6849 4.8133 5.0538 5.8333 5.6688 4.9469 4.0393 4.3541 4.4733 4.1306 5.3980 6.8440 4.3834 6.0331 2.5198 1.4956 1.1839 3.3455 2.9682 2.7801 2.7055 3.1151 6.1137 5.8982 4.8420 6.9750 4.6108 7.3260 2.5086 2.0978 4.3154 5.1911 2.9378 2.4378 1.9710 1.1836 2.1768 5.5350 1.4711 3.4829 1.7742 1.6263 1.7821 1.4385 1.5395 1.4765 1.4137 1.4186 4.0911 3.1091 1.3176 1.4039 2.5838 1.3251 6.1005 6.0769 6.0530 1.5674 1.5585 1.5269 1.3563 1.3382 1.5486 1.9299 1.7598 1.1735 1.1445 1.1933 5.7283 1.5039 2.0333 1.4562 1.5806 2.3664 7.9750 8.2832 9.5337 3.0927 2.9629 2.9815 2.5373 2.8612 3.2092 6.5937 6.8461 6.6299 7.3282 6.2981 6.2884 1.1385 1.1390 1.0870 1.0877 1.0907 1.0882 1.0941 1.0938 1.0907 1.0927 1.0937 1.0961 1.0965 1.0963 1.0596 1.0457 1.1002 1.0918
irintensity: 0.3666 0.6165 2.8287 0.6294 0.8966 3.6242 1.1036 1.0705 0.3146 0.8244 3.6961 5.1832 3.0266 1.3176 0.2808 1.3809 16.6806 108.0044 8.9812 5.3703 2.9538 18.2484 5.7099 5.2881 1.1954 9.8676 1.1741 24.9738 0.3841 49.8371 120.6884 23.2399 2.6667 9.6587 54.2703 32.9182 235.4796 21.8484 5.8278 54.1912 43.3444 42.0138 18.0439 68.6844 1.5636 36.4663 20.8328 1.1030 5.3424 28.4458 71.6438 1.4992 4.2868 83.9929 3.1028 8.7449 1.9378 0.7424 4.9905 2.8023 13.7481 8.9833 19.0343 29.8204 125.4873 118.7985 13.2465 13.0524 19.0701 337.0026 57.1620 63.1375 21.7484 11.3131 42.7066 2.6208 16.9869 8.3523 35.0576 24.7691 23.3628 129.0337 96.5319 105.3021 168.7067 163.6587 28.9842 7.8886 130.6120 279.7031 103.5061 138.6099 11.8440 9.5336 7.7934 20.2066 34.8219 18.8327 6.1522 4.7441 3.0753 4.4129 3.9988 4.1518 368.4613 25.2485 12.7977 50.3360
temp: 298.150 k
press: 1.00000 atm
elementType: 8 8 7 7 6 6 6 6 6 6 6 6 6 6 6 6 6 6 6 6 6 6 1 1 1 1 1 1 1 1 1 1 1 1 1 1 1 1
symmnumber: 1
zpe: 782660.3 jmol-1
zpe.correction: 0.298100 hartree
zpe.thermalcorrener: 0.316604 hartree
zpe.thermalcorrenthalpy: 0.317548 hartree
zpe.thermalcorrgfe: 0.251397 hartree
zpe.sumelectzpe: -953.920177 hartree
zpe.sumelectthermal: -953.901673 hartree
zpe.sumelectthermalent: -953.900729 hartree
zpe.sumelectthermalfe: -953.966880 hartree
dipole: 2.0711 -4.0786 2.5282
dipole: 5.2265
quadrupole: -132.1714 -105.1726 -122.8201
quadrupole: -4.8891 5.1923 -1.1943
quadrupole: -12.1167 14.8821 -2.7654 -4.8891 5.1923 -1.1943
hfenergy: -954.218277 hartree
pointgroup: C01 [X(C18H16N2O2)]
dipole: -0.7943107 -1.5322264 -1.1178179 debye
polarizability: 235.0543305|2.5437523|278.4290643|0.0895737|0.4040519|144.7217017 unknown
InChI: InChI=1S/C18H16N2O2/c19-13-4-1-6-15(10-13)21-17-8-3-9-18(12-17)22-16-7-2-5-14(20)11-16/h1-12H,19-20H2
charge 0 multiplicity 1
38 atoms
O  -2.457272 1.535695 0.609307
O  2.468291 1.57931 0.167105
N  -1.630194 -2.48622 -2.1115
N  1.336602 -3.077442 -1.024284
C  -1.233653 2.160906 0.237799
C  1.185806 2.149532 0.028494
C  -0.000805 1.501515 0.435591
C  -2.619458 0.14867 0.35259
C  2.677783 0.169155 0.223568
C  -1.302237 3.472934 -0.272686
C  1.150596 3.466431 -0.49038
C  -0.092539 4.121745 -0.616687
C  -2.060882 -0.464593 -0.790519
C  1.861418 -0.756149 -0.459509
C  -2.259992 -1.85136 -1.008332
C  2.163386 -2.148244 -0.392555
C  -3.417897 -0.576498 1.262897
C  3.824802 -0.23493 0.940307
C  -3.050615 -2.598895 -0.093656
C  3.324889 -2.566065 0.32522
C  -3.627143 -1.952216 1.020436
C  4.138167 -1.612353 0.968708
H  0.026905 0.508101 0.888099
H  -2.275114 3.955177 -0.399028
H  2.088104 3.947809 -0.781827
H  -0.123275 5.143148 -1.010758
H  -1.470827 0.128182 -1.497767
H  1.001661 -0.419739 -1.045517
H  -3.843195 -0.06813 2.131776
H  4.438143 0.514305 1.446617
H  -3.20937 -3.671985 -0.252583
H  3.574994 -3.63236 0.380373
H  -4.240496 -2.532573 1.718379
H  5.026382 -1.947791 1.516131
H  -1.3649 -1.896285 -2.902372
H  -1.97527 -3.411424 -2.371814
H  1.559721 -4.066732 -0.951267
H  0.405086 -2.823632 -1.374056
