program: Orca
programVersion: 5.0.2
elementType: Br Cl S P O O O C C C C C C C C C C C H H H H H H H H H H H H H H H
charge: 0
multiplicity: 1
keywords: wb97x-d3
keywords: def2-TZVPP
keywords: def2/J RIJCOSX
keywords: DEFGRID2
keywords: scfconv7
keywords: smallprint printgap noloewdin
keywords: NOSOSCF
formula: C11H15BrClO3PS
InChI: InChI=1/C11H15BrClO3PS/c1-3-7-18-17(14,15-4-2)16-11-6-5-9(12)8-10(11)13/h5-6,8H,3-4,7H2,1-2H3
33 atoms
Br 4.483923 -0.703665 0.054728
Cl 0.253834 2.688296 -0.890341
S  -2.793026 -1.558208 0.786129
P  -2.431996 0.306425 -0.020921
O  -1.246132 0.910727 0.926376
O  -3.665887 1.161073 0.484619
O  -2.123261 0.341871 -1.468984
C  -3.087336 -2.602817 -0.699639
C  -1.898746 -3.476458 -1.055329
C  -0.680662 -2.731318 -1.568323
C  0.058016 0.537497 0.728604
C  -3.92699 2.51774 0.032128
C  0.874246 1.282644 -0.114211
C  0.580971 -0.556613 1.397328
C  -3.255333 3.546083 0.905397
C  2.197254 0.92143 -0.315165
C  1.901191 -0.930322 1.207462
C  2.693703 -0.194688 0.34022
H  -3.392445 -1.967918 -1.529543
H  -3.94605 -3.215319 -0.42776
H  -1.629343 -4.090095 -0.193294
H  -2.24979 -4.171272 -1.823033
H  -0.264829 -2.060056 -0.816606
H  0.106334 -3.435021 -1.840146
H  -0.915311 -2.142027 -2.454696
H  -3.627241 2.621724 -1.011345
H  -5.009539 2.616539 0.080541
H  -0.043098 -1.122949 2.074835
H  -3.609512 4.533648 0.609127
H  -3.506997 3.405004 1.956099
H  -2.171703 3.539663 0.79801
H  2.817032 1.511081 -0.97671
H  2.287506 -1.791448 1.734797
elementType: Br Cl S P O C H
totalener: -4428.05277011 hartree
nucrepener: 2281.37978901 hartree
electener: -6709.43255912 hartree
twoeener: 3966.26047186 hartree
cpcmener: -0.02480630 hartree
kineticenergy: 4419.41890020 hartree
xcener: -190.169640369286 hartree
chargesum: 0.0000000
charge: -0.027510 -0.062282 -0.174692 0.837730 -0.362574 -0.357827 -0.619219 -0.077882 -0.085072 -0.247647 0.256616 0.042723 0.007514 -0.187449 -0.240386 -0.074953 -0.085194 -0.057334 0.108544 0.130771 0.067796 0.076224 0.040026 0.099160 0.087300 0.095017 0.111778 0.155939 0.099526 0.091921 0.070575 0.130184 0.150679
qa: -0.0275 -0.0623 -0.1747 0.8377 -0.3626 -0.3578 -0.6192 -0.0779 -0.0851 -0.2476 0.2566 0.0427 0.0075 -0.1874 -0.2404 -0.0750 -0.0852 -0.0573 0.1085 0.1308 0.0678 0.0762 0.0400 0.0992 0.0873 0.0950 0.1118 0.1559 0.0995 0.0919 0.0706 0.1302 0.1507
va: 1.2240 1.2498 2.2861 5.4811 2.0874 2.1335 1.9568 3.8512 3.8933 3.9356 3.7093 3.8625 4.0366 3.9840 3.9256 3.9235 3.8658 3.9908 1.0308 1.0081 1.0108 1.0091 1.0120 1.0099 1.0089 1.0040 0.9897 1.0018 1.0077 1.0064 1.0231 1.0090 0.9931
dispcorr: -0.018815371 hartree
energy: -4428.071585478217
dipole: -63.49203 62.72110 -0.77093 -2.75622 2.13416 -0.62205 -2.92152 3.66502 0.74350
magnitude: 1.23857 au
magnitude: 3.14821 debye
