program: Orca
programVersion: 5.0.2
elementType: Br Cl S P O O O C C C C C C C C C C C H H H H H H H H H H H H H H H
charge: 0
multiplicity: 1
keywords: wb97x-d3
keywords: def2-TZVPP
keywords: def2/J RIJCOSX
keywords: DEFGRID2
keywords: scfconv7
keywords: smallprint printgap noloewdin
keywords: NOSOSCF
formula: C11H15BrClO3PS
InChI: InChI=1/C11H15BrClO3PS/c1-3-7-18-17(14,15-4-2)16-11-6-5-9(12)8-10(11)13/h5-6,8H,3-4,7H2,1-2H3
33 atoms
Br 4.818382 1.470742 -0.245337
Cl 0.775059 -2.249055 -0.494372
S  -3.484682 -1.192222 0.955056
P  -2.024306 0.093972 0.291542
O  -0.733917 -0.358053 1.17853
O  -2.401519 1.470459 0.987473
O  -1.748236 0.12709 -1.162706
C  -3.227233 -2.62657 -0.159436
C  -3.966853 -2.495618 -1.477604
C  -3.717312 -3.708019 -2.361559
C  0.517086 0.086864 0.830026
C  -3.161384 2.499389 0.307713
C  1.340195 -0.718423 0.052426
C  0.982534 1.309902 1.281618
C  -4.61985 2.144872 0.161172
C  2.625646 -0.314057 -0.268174
C  2.264812 1.730247 0.968403
C  3.07338 0.914056 0.192097
H  -3.595995 -3.478549 0.413482
H  -2.158065 -2.782747 -0.302087
H  -5.035699 -2.387681 -1.28312
H  -3.647097 -1.590341 -1.994385
H  -2.655725 -3.822617 -2.586317
H  -4.058088 -4.628354 -1.884828
H  -4.246501 -3.610301 -3.309572
H  -3.037806 3.382802 0.930259
H  -2.703747 2.704582 -0.660675
H  0.34555 1.932862 1.895488
H  -5.074746 1.908288 1.122851
H  -5.144984 3.005283 -0.254142
H  -4.77684 1.305561 -0.516195
H  3.253333 -0.955462 -0.871575
H  2.613163 2.686426 1.33336
elementType: Br Cl S P O C H
totalener: -4428.05479100 hartree
nucrepener: 2224.01344625 hartree
electener: -6652.06823725 hartree
twoeener: 3908.88383244 hartree
cpcmener: -0.02525190 hartree
kineticenergy: 4419.43160741 hartree
xcener: -190.170020748486 hartree
chargesum: -0.0000000
charge: -0.028442 -0.064483 -0.158736 0.828090 -0.361140 -0.362544 -0.620551 -0.078616 -0.096241 -0.268491 0.230707 0.047229 -0.003019 -0.170295 -0.255759 -0.055048 -0.089921 -0.066034 0.133219 0.111553 0.068891 0.064379 0.082669 0.085312 0.094148 0.109106 0.102747 0.160414 0.092688 0.103227 0.084740 0.130072 0.150130
qa: -0.0284 -0.0645 -0.1587 0.8281 -0.3611 -0.3625 -0.6206 -0.0786 -0.0962 -0.2685 0.2307 0.0472 -0.0030 -0.1703 -0.2558 -0.0550 -0.0899 -0.0660 0.1332 0.1116 0.0689 0.0644 0.0827 0.0853 0.0941 0.1091 0.1027 0.1604 0.0927 0.1032 0.0847 0.1301 0.1501
va: 1.2228 1.2498 2.2975 5.4718 2.0978 2.1207 1.9487 3.8384 3.9034 3.9586 3.7823 3.8420 4.0292 4.0318 3.9188 3.8986 3.8796 3.9901 1.0059 1.0283 1.0126 1.0264 1.0017 1.0005 1.0036 0.9899 1.0042 1.0006 1.0021 1.0108 1.0081 1.0082 0.9928
dispcorr: -0.016838799 hartree
energy: -4428.071629796585
dipole: -81.56789 80.39060 -1.17729 -16.61934 17.17314 0.55380 -4.84004 5.47596 0.63592
magnitude: 1.44814 au
magnitude: 3.68087 debye
